{"text_format":"2","workbook":"xlsx","n_sheets":8,"sheets":["Welcome","Company Information","Engine Information","Non-emergency Use","Worksheet Map","Revisions","Lists","Options"],"not_rendered":{"charts":0,"images":1,"macros":0,"external_links":0,"defined_names":9,"comments":0,"pivot_tables":0},"unopened":[],"bounds":{"document_bytes":16777216,"sheet_cells":100000,"run_cost":"one","rows_first":2000,"rows_last":500,"rows_between":2000,"halvings":0,"cell_chars":16384,"cell_head_chars":4096},"cells_cut":0,"cells_raw":0,"read":"whole","date_system":"1900"}

{"sheet":"Welcome","index":0,"n_rows":30,"n_cols":2,"rows_kept":30,"cut":false,"hidden":false,"merged":[]}
[]
["Template Name","60.4214(d)(3) Annual Report (Spreadsheet Template)"]
["CitationID","60.4214(d)(3)"]
["Template Version","ICR Draft"]
["Last Updated Date","9/9/2022"]
[null,"OMB No.: 2060-0590 Form 5900-595 For further Paperwork Reduction Act information see: \nhttps://www.epa.gov/electronic-reporting-air-emissions/paperwork-reduction-act-pra-cedri-and-ert"]
[null,"Instructions for Bulk Upload"]
[null,"Stationary Compression Ignition Internal Combustion Engines (60, subpart IIII): 60.4214(d)(3) Annual Report (Spreadsheet Template Option)"]
[null,"The CEDRI bulk data upload feature allows you to submit data in a single report for multiple facilities using this EPA provided Excel workbook. Data for all companies and related engines must be entered into the worksheet labeled “Company Information” and “Engine Information” accordingly in this Excel workbook. Each row in the “Company Information” worksheet includes the data for a single company. Please provide Engine specific data (if applicable) non-emergency use in the Non-emergency Use worksheet. \n"]
[null,"If necessary, you may reference a file attachment in the last column of the “Company Information” worksheet within the applicable company row. A single attachment may be referenced by all records, or individual attachments may be included for each company record.\n"]
[null,"Bulk uploads must be uploaded into CEDRI as a single ZIP file, which must include this worksheet and any related file attachments. "]
[null,"Note: If you are uploading file attachments for your report, the uploaded files may be in any file format (e.g., zip, .docx, PDF). If you would like to include an excel file(s) as an attachment, you must first zip the excel file(s) into a separate zip file and then add the separate ZIP file to the master ZIP file that will be uploaded into CEDRI.\n"]
[null,"Once all data has been entered in the worksheet, combine this Excel workbook and all attachment files (including a ZIP file containing separate excel file(s), if applicable) into a single ZIP file for upload to CEDRI.\n"]
[null,"Please ensure your report includes all of the required data elements found in the listed citations below for this bulk upload submission.\n"]
[null,"Do not submit information you claim as confidential business information (CBI) to EPA via CEDRI. EPA will make all the information submitted through CEDRI available to the public without further notice to you. Anything submitted using CEDRI cannot later be claimed to be CBI. Furthermore, under CAA section 114(c) emissions data is not entitled to confidential treatment and requires EPA to make emissions data available to the public. Thus, emissions data will not be protected as CBI and will be made publicly available.\n"]
[null,"Although we do not expect persons to assert a claim of CBI, if persons wish to assert a CBI claim, you must submit the report via CEDRI with the CBI omitted and mail a complete report, including any information claimed to be CBI, to EPA on a compact disc, flash drive, or other commonly used electronic storage media via U.S. postal service. You must mark the outside of the digital storage media as CBI and then identify electronically within the digital storage media the specific information that is claimed as CBI. Mail the media to the address in the referencing federal regulation. If no address is specified, mail the media to:\n"]
[null,"U.S. EPA/OAQPS/CORE CBI Office Attention: Group Leader, \nMeasurement Policy Group MD C404-02\n4930 Old Page Rd\nDurham, North Carolina 27703\n"]
[null,"Fill out this form if you own or operate an emergency stationary Compression Ignition Internal Combustion Engines (CI ICE) with a maximum engine power more than 100 HP that operates or is contractually obligated to be available for more than 15 hours per calendar year for the purposes specified in §60.4211(f)(2)(ii) and (iii) or that operates for the purposes specified in §60.4211(f)(3)(i). §60.4214(d)"]
[null,"§60.4214(d)(1)(i)"]
[null,"Provide your company name and address where the engine is located."]
{"$rows_left_out":11}
{"sheet":"Company Information","index":1,"n_rows":2512,"n_cols":13,"rows_kept":2512,"cut":false,"hidden":false,"merged":[]}
[]
[]
[]
[]
[]
[]
[null,"Part 60 - Standards of Performance for New Stationary Sources (NSPS) Subpart IIII - Stationary Compression Ignition Internal Combustion Engines - 60.4214(d)(3) Annual Report"]
[]
[]
[]
[null,"COMPANY INFORMATION",{"$nulls":7},"REPORTING INFORMATION",null,"ADDITIONAL INFORMATION"]
[null,"Company Record No. \n(Field value will automatically generate once Company Name is added in Column C.)","Company Name\n(§60.4214(d)(1)(i))","Address where the Engine is located\n(§60.4214(d)(1)(i))","Address 2\n(§60.4214(d)(1)(i))","City \n(§60.4214(d)(1)(i))","County \n(§60.4214(d)(1)(i))","State Abbreviation\n(§60.4214(d)(1)(i))\n(Select from dropdown)","Zip Code\n(§60.4214(d)(1)(i))","Beginning Date of Reporting Period  \n(§60.4214(d)(1)(ii)) ","Ending Date of Reporting Period  \n(§60.4214(d)(1)(ii)) ","Please enter any additional information","Enter associated file name reference. (e.g.: filename.pdf)"]
[null,"RecordId","CompanyName","AddressLine1","AddressLine2","CityName","CountyName","StateName","ZIPCode","PeriodStartDate","PeriodEndDate","AddInfo","AddFile"]
[null,"e.g.: 1","e.g.: ABC Company","e.g.: 123 Main Street","e.g.: Suite 100","e.g.: Brooklyn","e.g.: Kings","e.g.: NY","e.g.: 11221","e.g.: 01/01/2020","e.g.: 6/30/2020",null,"e.g.: addfile.zip"]
[null,"e.g.:","e.g.:","e.g.:","e.g.:","e.g.:","e.g.:","e.g.:","e.g.:","e.g.:","e.g.:","e.g.:","e.g.:"]
[null,"e.g.:","e.g.:","e.g.:","e.g.:","e.g.:","e.g.:","e.g.:","e.g.:","e.g.:","e.g.:","e.g.:","e.g.:"]
[null,"e.g.:","e.g.:","e.g.:","e.g.:","e.g.:","e.g.:","e.g.:","e.g.:","e.g.:","e.g.:","e.g.:","e.g.:"]
[null,"e.g.:","e.g.:","e.g.:","e.g.:","e.g.:","e.g.:","e.g.:","e.g.:","e.g.:","e.g.:","e.g.:","e.g.:"]
[null,"e.g.:","e.g.:","e.g.:","e.g.:","e.g.:","e.g.:","e.g.:","e.g.:","e.g.:","e.g.:","e.g.:","e.g.:"]
[null,"e.g.:","e.g.:","e.g.:","e.g.:","e.g.:","e.g.:","e.g.:","e.g.:","e.g.:","e.g.:","e.g.:","e.g.:"]
{"$rows_left_out":2493}
{"sheet":"Engine Information","index":2,"n_rows":1023,"n_cols":13,"rows_kept":1023,"cut":false,"hidden":false,"merged":[]}
[]
[]
[]
[]
[]
[]
[null,"Part 60 - Standards of Performance for New Stationary Sources (NSPS) Subpart IIII - Stationary Compression Ignition Internal Combustion Engines"]
[null," 60.4214(d)(3) Annual Report"]
[]
[]
[]
[null,"Engine Record No. \n(Autocompleted once Column C filled)","Company Record No. \n(Select from dropdown)","Engine Description\n(§60.4214(d)(1)(iii))","Engine Site Rating \n(Brake Horsepower) (§60.4214(d)(1)(iii))","Engine Model Year \n(§60.4214(d)(1)(iii))","Latitude of the Engine \n(§60.4214(d)(1)(iv))","Longitude of the Engine \n(§60.4214(d)(1)(iv))","Did you use this engine for the purpose specified in \n§60.4211(f)(3)(i): 50 hours per year for non-emergency situations? \n(Select from dropdown)","Column1","Column2","Column3","Column4"]
[null,"EngineId","RecordId","EngineDescription","EngineRating","EngineYear","EngineLatitude","EngineLongitude","NonEmergencyFlag"]
[null,"e.g.: 1","e.g.: 1","e.g.: Engine 1","e.g.: 100","e.g.: 2020","e.g.: 12.12345","e.g.: -12.12345","e.g.: Yes"]
[null,"e.g.:","e.g.:","e.g.:","e.g.:","e.g.:","e.g.:","e.g.:","e.g.:"]
[null,"e.g.:","e.g.:","e.g.:","e.g.:","e.g.:","e.g.:","e.g.:","e.g.:"]
[null,"e.g.:","e.g.:","e.g.:","e.g.:","e.g.:","e.g.:","e.g.:","e.g.:"]
[null,"e.g.:","e.g.:","e.g.:","e.g.:","e.g.:","e.g.:","e.g.:","e.g.:"]
[null,"e.g.:","e.g.:","e.g.:","e.g.:","e.g.:","e.g.:","e.g.:","e.g.:"]
[null,"e.g.:","e.g.:","e.g.:","e.g.:","e.g.:","e.g.:","e.g.:","e.g.:"]
{"$rows_left_out":1004}
{"sheet":"Non-emergency Use","index":3,"n_rows":23,"n_cols":8,"rows_kept":23,"cut":false,"hidden":false,"merged":[]}
[]
[]
[]
[]
[]
[]
[null,"Part 60 - Standards of Performance for New Stationary Sources (NSPS) Subpart IIII - Stationary Compression Ignition Internal Combustion Engines"]
[null," 60.4214(d)(3) Annual Report"]
[]
[]
[]
[null,"Engine Record No. \n(Select from dropdown)"," Non-Emergency Use\n Event Begin Date \n(§60.4214(b))"," Non-Emergency Use\n Event Begin Time \n(§60.4214(b))"," Non-Emergency Use\n Event End Date\n(§60.4214(b))"," Non-Emergency Use\n Event End Time\n(§60.4214(b))","Entity Who Dispatched the Engine\n(§60.4214(b))","Situation That Necessitated the Dispatch of the Engine\n(§60.4214(b))"]
[null,"EngineId","NonEmergencyStartDate","NonEmergencyStartTime","NonEmergencyEndDate","NonEmergencyEndTime","DispatchEntity","DispatchReason"]
[null,"e.g.: 1","e.g.: 02/01/2020","e.g.: 15:00","e.g.: 02/02/2020","e.g.: 15:00","e.g.: Dispatcher","e.g.: Engine Malfunction"]
[null,"e.g.:","e.g.:","e.g.:","e.g.:","e.g.:","e.g.:","e.g.:"]
[null,"e.g.:","e.g.:","e.g.:","e.g.:","e.g.:","e.g.:","e.g.:"]
[null,"e.g.:","e.g.:","e.g.:","e.g.:","e.g.:","e.g.:","e.g.:"]
[null,"e.g.:","e.g.:","e.g.:","e.g.:","e.g.:","e.g.:","e.g.:"]
[null,"e.g.:","e.g.:","e.g.:","e.g.:","e.g.:","e.g.:","e.g.:"]
[null,"e.g.:","e.g.:","e.g.:","e.g.:","e.g.:","e.g.:","e.g.:"]
{"$rows_left_out":4}
{"sheet":"Worksheet Map","index":4,"n_rows":4,"n_cols":5,"rows_kept":4,"cut":false,"hidden":true,"merged":[]}
["Worksheet Name","Parent","JSON Key","Parent Primary Key","Child Foreign Key"]
["Company Information",null,"records"]
["Engine Information","records","EngineInformation","RecordId","RecordId"]
["Non-emergency Use","EngineInformation","NonemergencyUse","EngineId","EngineId"]

{"sheet":"Revisions","index":5,"n_rows":12,"n_cols":3,"rows_kept":12,"cut":false,"hidden":false,"merged":[]}
["Part 60 - Standards of Performance for New Stationary Sources (NSPS) Subpart IIII - Stationary Compression Ignition Internal Combustion Engines"]
[" 60.4214(d)(3) Annual Report"]
["Revision Number","Date","Revisions"]
[1,"2016-02-01","Initial Release Version"]
[1.01,"2019-03-13","Updated the State dropdown to include VI, PR, AS, MP, and GU."]
[1.02,"2020-01-28","Updated in Engine Information tab column L so Yes/No dropdown is visible"]
[2,"2020-03-27","Added hidden mapping sheet and hidden column A to accommodate CEDRI EXCEL JSON Parser."]
[2.0099999999999998,"2020-05-12","Updated CBI dislaimer."]
[3,"2021-01-22","Removed hidden columns found on the Engine Information tab: columns I through L due to issues with parsing data elements without XML tags; updated instructions/headers on data entry tabs"]
[3.01,"2021-02-19","added regulation citations, reformatted sheets, updated Welcome page instructions, enabled filtering for data tables and added \"e.g.:\" to blank example rows to enable easy hiding of those rows"]
[3.02,"2021-03-24","Increased number of entry rows on all tabs, corrected data validation in d27 of Engine Information and font in column B of Company Information, revised calculation for Company record Number and Engine Record Number; Deleted unused tabs "]
["ICR Draft","2022-09-09","Changed color of column A to denote locked cells on Company Information and Engine Information tabs, and locked column A of Engine Information., updated orientation of header and data rows, added header to Revision tab, removed merging of cells in headers, removed shading of header rows, added PRA information to Welcome"]

{"sheet":"Lists","index":6,"n_rows":1001,"n_cols":13,"rows_kept":1001,"cut":false,"hidden":true,"merged":[]}
["Column1","Column2","CompanyList","Column4",null,"States",null,"Column1","Column2","EngineList","Column4",null,"YesNo"]
[{"$f":"+IF(D2=\"\",\"\",MAX(A$1:A1)+1)","v":""},{"$f":"+IF('Company Information'!B24=\"\",\"\",'Company Information'!B24)","v":""},{"$f":"+IFERROR(INDEX(B$2:B$1001,MATCH(ROW()-ROW($H$1),A$2:A$1001,0)),\"\")","v":""},{"$f":"IF(COUNTIF(B$2:B2,B2)=1,B2,\"\")","v":""},null,"AK",null,{"$f":"+IF(K2=\"\",\"\",MAX(H$1:I1)+1)","v":""},{"$f":"+IF('Engine Information'!B24=\"\",\"\",'Engine Information'!B24)","v":""},{"$f":"+IFERROR(INDEX(I$2:I$1001,MATCH(ROW()-ROW($H$1),H$2:H$1001,0)),\"\")","v":""},{"$f":"IF(COUNTIF(I$2:I2,I2)=1,I2,\"\")","v":""},null,"Yes"]
[{"$f":"+IF(D3=\"\",\"\",MAX(A$1:A2)+1)","v":""},{"$f":"+IF('Company Information'!B25=\"\",\"\",'Company Information'!B25)","v":""},{"$f":"+IFERROR(INDEX(B$2:B$1001,MATCH(ROW()-ROW($H$1),A$2:A$1001,0)),\"\")","v":""},{"$f":"IF(COUNTIF(B$2:B3,B3)=1,B3,\"\")","v":""},null,"AL",null,{"$f":"+IF(K3=\"\",\"\",MAX(H$1:I2)+1)","v":""},{"$f":"+IF('Engine Information'!B25=\"\",\"\",'Engine Information'!B25)","v":""},{"$f":"+IFERROR(INDEX(I$2:I$1001,MATCH(ROW()-ROW($H$1),H$2:H$1001,0)),\"\")","v":""},{"$f":"IF(COUNTIF(I$2:I3,I3)=1,I3,\"\")","v":""},null,"No"]
[{"$f":"+IF(D4=\"\",\"\",MAX(A$1:A3)+1)","v":""},{"$f":"+IF('Company Information'!B26=\"\",\"\",'Company Information'!B26)","v":""},"",{"$f":"IF(COUNTIF(B$2:B4,B4)=1,B4,\"\")","v":""},null,"AR",null,{"$f":"+IF(K4=\"\",\"\",MAX(H$1:I3)+1)","v":""},{"$f":"+IF('Engine Information'!B26=\"\",\"\",'Engine Information'!B26)","v":""},"",{"$f":"IF(COUNTIF(I$2:I4,I4)=1,I4,\"\")","v":""}]
[{"$f":"+IF(D5=\"\",\"\",MAX(A$1:A4)+1)","v":""},{"$f":"+IF('Company Information'!B27=\"\",\"\",'Company Information'!B27)","v":""},"",{"$f":"IF(COUNTIF(B$2:B5,B5)=1,B5,\"\")","v":""},null,"AS",null,{"$f":"+IF(K5=\"\",\"\",MAX(H$1:I4)+1)","v":""},{"$f":"+IF('Engine Information'!B27=\"\",\"\",'Engine Information'!B27)","v":""},"",{"$f":"IF(COUNTIF(I$2:I5,I5)=1,I5,\"\")","v":""}]
[{"$f":"+IF(D6=\"\",\"\",MAX(A$1:A5)+1)","v":""},{"$f":"+IF('Company Information'!B28=\"\",\"\",'Company Information'!B28)","v":""},"",{"$f":"IF(COUNTIF(B$2:B6,B6)=1,B6,\"\")","v":""},null,"AZ",null,{"$f":"+IF(K6=\"\",\"\",MAX(H$1:I5)+1)","v":""},{"$f":"+IF('Engine Information'!B28=\"\",\"\",'Engine Information'!B28)","v":""},"",{"$f":"IF(COUNTIF(I$2:I6,I6)=1,I6,\"\")","v":""}]
[{"$f":"+IF(D7=\"\",\"\",MAX(A$1:A6)+1)","v":""},{"$f":"+IF('Company Information'!B29=\"\",\"\",'Company Information'!B29)","v":""},"",{"$f":"IF(COUNTIF(B$2:B7,B7)=1,B7,\"\")","v":""},null,"CA",null,{"$f":"+IF(K7=\"\",\"\",MAX(H$1:I6)+1)","v":""},{"$f":"+IF('Engine Information'!B29=\"\",\"\",'Engine Information'!B29)","v":""},"",{"$f":"IF(COUNTIF(I$2:I7,I7)=1,I7,\"\")","v":""}]
[{"$f":"+IF(D8=\"\",\"\",MAX(A$1:A7)+1)","v":""},{"$f":"+IF('Company Information'!B30=\"\",\"\",'Company Information'!B30)","v":""},"",{"$f":"IF(COUNTIF(B$2:B8,B8)=1,B8,\"\")","v":""},null,"CO",null,{"$f":"+IF(K8=\"\",\"\",MAX(H$1:I7)+1)","v":""},{"$f":"+IF('Engine Information'!B30=\"\",\"\",'Engine Information'!B30)","v":""},"",{"$f":"IF(COUNTIF(I$2:I8,I8)=1,I8,\"\")","v":""}]
[{"$f":"+IF(D9=\"\",\"\",MAX(A$1:A8)+1)","v":""},{"$f":"+IF('Company Information'!B31=\"\",\"\",'Company Information'!B31)","v":""},"",{"$f":"IF(COUNTIF(B$2:B9,B9)=1,B9,\"\")","v":""},null,"CT",null,{"$f":"+IF(K9=\"\",\"\",MAX(H$1:I8)+1)","v":""},{"$f":"+IF('Engine Information'!B31=\"\",\"\",'Engine Information'!B31)","v":""},"",{"$f":"IF(COUNTIF(I$2:I9,I9)=1,I9,\"\")","v":""}]
[{"$f":"+IF(D10=\"\",\"\",MAX(A$1:A9)+1)","v":""},{"$f":"+IF('Company Information'!B32=\"\",\"\",'Company Information'!B32)","v":""},"",{"$f":"IF(COUNTIF(B$2:B10,B10)=1,B10,\"\")","v":""},null,"DC",null,{"$f":"+IF(K10=\"\",\"\",MAX(H$1:I9)+1)","v":""},{"$f":"+IF('Engine Information'!B32=\"\",\"\",'Engine Information'!B32)","v":""},"",{"$f":"IF(COUNTIF(I$2:I10,I10)=1,I10,\"\")","v":""}]
[{"$f":"+IF(D11=\"\",\"\",MAX(A$1:A10)+1)","v":""},{"$f":"+IF('Company Information'!B33=\"\",\"\",'Company Information'!B33)","v":""},"",{"$f":"IF(COUNTIF(B$2:B11,B11)=1,B11,\"\")","v":""},null,"DE",null,{"$f":"+IF(K11=\"\",\"\",MAX(H$1:I10)+1)","v":""},{"$f":"+IF('Engine Information'!B33=\"\",\"\",'Engine Information'!B33)","v":""},"",{"$f":"IF(COUNTIF(I$2:I11,I11)=1,I11,\"\")","v":""}]
[{"$f":"+IF(D12=\"\",\"\",MAX(A$1:A11)+1)","v":""},{"$f":"+IF('Company Information'!B34=\"\",\"\",'Company Information'!B34)","v":""},"",{"$f":"IF(COUNTIF(B$2:B12,B12)=1,B12,\"\")","v":""},null,"FL",null,{"$f":"+IF(K12=\"\",\"\",MAX(H$1:I11)+1)","v":""},{"$f":"+IF('Engine Information'!B34=\"\",\"\",'Engine Information'!B34)","v":""},"",{"$f":"IF(COUNTIF(I$2:I12,I12)=1,I12,\"\")","v":""}]
[{"$f":"+IF(D13=\"\",\"\",MAX(A$1:A12)+1)","v":""},{"$f":"+IF('Company Information'!B35=\"\",\"\",'Company Information'!B35)","v":""},"",{"$f":"IF(COUNTIF(B$2:B13,B13)=1,B13,\"\")","v":""},null,"GA",null,{"$f":"+IF(K13=\"\",\"\",MAX(H$1:I12)+1)","v":""},{"$f":"+IF('Engine Information'!B35=\"\",\"\",'Engine Information'!B35)","v":""},"",{"$f":"IF(COUNTIF(I$2:I13,I13)=1,I13,\"\")","v":""}]
[{"$f":"+IF(D14=\"\",\"\",MAX(A$1:A13)+1)","v":""},{"$f":"+IF('Company Information'!B36=\"\",\"\",'Company Information'!B36)","v":""},"",{"$f":"IF(COUNTIF(B$2:B14,B14)=1,B14,\"\")","v":""},null,"GU",null,{"$f":"+IF(K14=\"\",\"\",MAX(H$1:I13)+1)","v":""},{"$f":"+IF('Engine Information'!B36=\"\",\"\",'Engine Information'!B36)","v":""},"",{"$f":"IF(COUNTIF(I$2:I14,I14)=1,I14,\"\")","v":""}]
[{"$f":"+IF(D15=\"\",\"\",MAX(A$1:A14)+1)","v":""},{"$f":"+IF('Company Information'!B37=\"\",\"\",'Company Information'!B37)","v":""},"",{"$f":"IF(COUNTIF(B$2:B15,B15)=1,B15,\"\")","v":""},null,"HI",null,{"$f":"+IF(K15=\"\",\"\",MAX(H$1:I14)+1)","v":""},{"$f":"+IF('Engine Information'!B37=\"\",\"\",'Engine Information'!B37)","v":""},"",{"$f":"IF(COUNTIF(I$2:I15,I15)=1,I15,\"\")","v":""}]
[{"$f":"+IF(D16=\"\",\"\",MAX(A$1:A15)+1)","v":""},{"$f":"+IF('Company Information'!B38=\"\",\"\",'Company Information'!B38)","v":""},"",{"$f":"IF(COUNTIF(B$2:B16,B16)=1,B16,\"\")","v":""},null,"IA",null,{"$f":"+IF(K16=\"\",\"\",MAX(H$1:I15)+1)","v":""},{"$f":"+IF('Engine Information'!B38=\"\",\"\",'Engine Information'!B38)","v":""},"",{"$f":"IF(COUNTIF(I$2:I16,I16)=1,I16,\"\")","v":""}]
[{"$f":"+IF(D17=\"\",\"\",MAX(A$1:A16)+1)","v":""},{"$f":"+IF('Company Information'!B39=\"\",\"\",'Company Information'!B39)","v":""},"",{"$f":"IF(COUNTIF(B$2:B17,B17)=1,B17,\"\")","v":""},null,"ID",null,{"$f":"+IF(K17=\"\",\"\",MAX(H$1:I16)+1)","v":""},{"$f":"+IF('Engine Information'!B39=\"\",\"\",'Engine Information'!B39)","v":""},"",{"$f":"IF(COUNTIF(I$2:I17,I17)=1,I17,\"\")","v":""}]
[{"$f":"+IF(D18=\"\",\"\",MAX(A$1:A17)+1)","v":""},{"$f":"+IF('Company Information'!B40=\"\",\"\",'Company Information'!B40)","v":""},"",{"$f":"IF(COUNTIF(B$2:B18,B18)=1,B18,\"\")","v":""},null,"IL",null,{"$f":"+IF(K18=\"\",\"\",MAX(H$1:I17)+1)","v":""},{"$f":"+IF('Engine Information'!B40=\"\",\"\",'Engine Information'!B40)","v":""},"",{"$f":"IF(COUNTIF(I$2:I18,I18)=1,I18,\"\")","v":""}]
[{"$f":"+IF(D19=\"\",\"\",MAX(A$1:A18)+1)","v":""},{"$f":"+IF('Company Information'!B41=\"\",\"\",'Company Information'!B41)","v":""},"",{"$f":"IF(COUNTIF(B$2:B19,B19)=1,B19,\"\")","v":""},null,"IN",null,{"$f":"+IF(K19=\"\",\"\",MAX(H$1:I18)+1)","v":""},{"$f":"+IF('Engine Information'!B41=\"\",\"\",'Engine Information'!B41)","v":""},"",{"$f":"IF(COUNTIF(I$2:I19,I19)=1,I19,\"\")","v":""}]
[{"$f":"+IF(D20=\"\",\"\",MAX(A$1:A19)+1)","v":""},{"$f":"+IF('Company Information'!B42=\"\",\"\",'Company Information'!B42)","v":""},"",{"$f":"IF(COUNTIF(B$2:B20,B20)=1,B20,\"\")","v":""},null,"KS",null,{"$f":"+IF(K20=\"\",\"\",MAX(H$1:I19)+1)","v":""},{"$f":"+IF('Engine Information'!B42=\"\",\"\",'Engine Information'!B42)","v":""},"",{"$f":"IF(COUNTIF(I$2:I20,I20)=1,I20,\"\")","v":""}]
{"$rows_left_out":982}
{"sheet":"Options","index":7,"n_rows":3,"n_cols":1,"rows_kept":3,"cut":false,"hidden":true,"merged":[]}
["YesNo"]
["Yes"]
["No"]