{"text_format":"2","workbook":"xlsx","n_sheets":14,"sheets":["Welcome","Facility_Information","General_Information","CMS_Deviation_Outage","Flares","Vapor_Tightness","Vapor_Collection","Monitored_Leaks","AVO_Leaks","Delay_of_Repair","LEL","Revisions","Worksheet Map","Lists"],"not_rendered":{"charts":0,"images":1,"macros":0,"external_links":0,"defined_names":2,"comments":0,"pivot_tables":0},"unopened":[],"bounds":{"document_bytes":16777216,"sheet_cells":100000,"run_cost":"one","rows_first":2000,"rows_last":500,"rows_between":2000,"halvings":0,"cell_chars":16384,"cell_head_chars":4096},"cells_cut":0,"cells_raw":0,"read":"whole","date_system":"1900"}

{"sheet":"Welcome","index":0,"n_rows":21,"n_cols":2,"rows_kept":21,"cut":false,"hidden":false,"merged":[]}
["DO NOT REMOVE OR EDIT INFORMATION IN ROWS 1 THROUGH 5\nFOR INTERNAL USE ONLY"]
["Template Name","Gasoline Distribution Semiannual Reports (Spreadsheet Template)"]
["CitationID","60.505a(c)"]
["Template Version","draft"]
["Last Updated Date","2023-09-28"]
[null,"OMB Control Numbers: 2060-xxxx (40 CFR Part 60, Subpart XXa); 2060-0325 (40 CFR Part 63, Subpart R); 2060-0620 (40 CFR Part 63, Subpart 6B)\nForm 5900-579\nFor further Paperwork Reduction Act information see: \nhttps://www.epa.gov/electronic-reporting-air-emissions/paperwork-reduction-act-pra-cedri-and-ert"]
[null,"40 CFR Part 60, Subpart XXa Standards of Performance for Bulk Gasoline Terminals\n40 CFR Part 63, Subpart R National Emission Standards for Gasoline Distribution Facilities (Bulk Gasoline Terminals and Pipeline Breakout Stations)\n40 CFR Part 63, Subpart BBBBBB National Emission Standards for Hazardous Air Pollutants for Source Category: Gasoline Distribution Bulk Terminals, Bulk Plants, and Pipeline Facilities"]
[null,"§60.505a(c), §63.428(m), and §63.11095(d) Semiannual Report Spreadsheet Template"]
[null,"Instructions for Spreadsheet Template"]
[null,"Purpose:"]
[null,"This spreadsheet template was designed by the U.S. EPA to facilitate compliance reporting for facilities subject under 40 CFR part 60, subpart XXa - Standards of Performance for Bulk Gasoline Terminals (NSPS XXa), 40 CFR Part 63, Subpart R National Emission Standards for Gasoline Distribution Facilities (Bulk Gasoline Terminals and Pipeline Breakout Stations), and 40 CFR Part 63 (NESHAP R), and Subpart BBBBBB National Emission Standards for Hazardous Air Pollutants for Source Category: Gasoline Distribution Bulk Terminals, Bulk Plants, and Pipeline Facilities (NESHAP 6B)."]
[null,"Electronic reporting:"]
[null,"Electronic submission of Semiannual Reports through the EPA's Compliance and Emissions Data Reporting Interface (CEDRI) is required under §60.505a(c), §63.428(m), and §63.11095(d). CEDRI is accessed through the EPA's Central Data Exchange (https://cdx.epa.gov)."]
[null,"Do not submit confidential business information (CBI) to EPA via CEDRI. EPA will make all the information submitted through this form via CEDRI available to the public without further notice to you. All CBI claims must be asserted at the time of submission. Anything submitted using CEDRI cannot later be claimed to be CBI. Furthermore, under CAA section 114(c) emissions data is not entitled to confidential treatment, and EPA is required to make emissions data available to the public. Thus, emissions data will not be protected as CBI and will be made publicly available."]
[null,"Although we do not expect persons to assert a claim of CBI, if persons wish to assert a CBI claim for some of the information in this report, you must submit a version of the report with the CBI omitted via CEDRI and submit a complete report, including any information claimed to be CBI, to EPA. The preferred method to receive CBI is for it to be transmitted electronically using email attachments, File Transfer Protocol, or other online file sharing services. Electronic submissions must be transmitted directly to the OAQPS CBI Office at the email address oaqpscbi@epa.gov to the attention of the Bulk Gasoline Terminal Sector Lead. If assistance is needed with submitting large electronic files that exceed the file size limit for email attachments, and if you do not have your own file sharing service, please email oaqpscbi@epa.gov to request a file transfer link. If you cannot transmit the file electronically, you may send CBI information through the postal service to the following address:"]
[null,"OAQPS Document Control Officer (C404-02)\nOAQPS, U.S. Environmental Protection Agency\nAttn: Bulk Gasoline Terminal Sector Lead.\nResearch Triangle Park, North Carolina 27711 "]
[null,"The mailed CBI material should be double wrapped and clearly marked. Any CBI markings should not show through the outer envelope. Clearly mark the part or all of the information that you claim to be CBI. Information not marked as CBI may be authorized for public release without prior notice. Information marked as CBI will not be disclosed except in accordance with procedures set forth in 40 CFR part 2."]
[null,"The CEDRI spreadsheet template upload feature allows you to submit data in a single report for a single facility or multiple facilities using this EPA provided Excel workbook.  Data for each facility must be entered into the worksheet labeled \"Facility_Information\" in this Excel workbook.  Each row in the \"Facility_Information\" worksheet includes the data for a single facility. The Facility Record No. will be used to match the information on each tab to the appropriate facility."]
[null,"IMPORTANT: The final CEDRI upload file must be a single ZIP file, which must include this Excel workbook and any related attachments that were referenced in the workbook (i.e., additional information file found in the \"Facility_Information\" worksheet)."]
[null,"For each facility record found in the \"Facility_Information\" worksheet, you may reference a single file attachment that includes additional information. If you are uploading file attachments for your report, the uploaded files may be in any format (e.g., zip, docx, PDF). If you would like to include an Excel file(s) as an attachment, you must first zip the excel file(s) into a separate ZIP file to the master ZIP file that will be uploaded into CEDRI.\n\nFor example, the file “Jan-June2019-Report.zip” uploaded into CEDRI may contain 2 files:\n                1. Completed_semiannual_reporting_spreadsheet_Jan-June2019.xlsx\n                2. Attachments.zip \nThe “Attachments.zip” file could contain as many attachments of any format (xlsx, xls, docx, pdf, zip, etc.) as needed.\nIf you only have one file to attach, you do not need to zip it unless it is an Excel file (.xlsx, .xls)."]
[null,"Template Navigation and Tabs to Complete:\n\nWithin the tabs, example rows are colored light orange (rows 14 through 23), and the XML tag row (row 13) is colored green.  These rows are locked; no data entry is made in these rows. "]

{"sheet":"Facility_Information","index":1,"n_rows":212,"n_cols":24,"rows_kept":212,"cut":false,"hidden":false,"merged":[]}
[null,"DO NOT REMOVE OR EDIT INFORMATION IN ROWS 1 THROUGH 5\nFOR INTERNAL USE ONLY"]
[null,"Template Name",{"$f":"Welcome!B2","v":"Gasoline Distribution Semiannual Reports (Spreadsheet Template)"}]
[null,"CitationID",{"$f":"Welcome!B3","v":"60.505a(c)"}]
[null,"Template Version",{"$f":"Welcome!B4","v":"draft"}]
[null,"Last Updated Date",{"$f":"Welcome!B5","v":"2023-09-28"}]
[]
[null,"40 CFR Part 60, Subpart XXa, 40 CFR Part 63, Subpart R, 40 CFR Part 63, Subpart BBBBBB - Gasoline Distribution"]
[null,"§60.505a(c), §63.428(m), and §63.11095(d) Semiannual  Report Spreadsheet Template"]
[null,"This tab includes information on the site(s) for which you are reporting and the reporting period."]
[]
[null,null,"SITE INFORMATION",{"$nulls":8},"Physical Location",null,"FACILITY CONTACT",{"$nulls":6},"REPORTING PERIOD",null,"ADDITIONAL INFORMATION"]
[null,"Facility Record No.\n(Field value will automatically generate if a value is not entered.)","Facility Name\n(§60.505a(c)(1)(i), §63.428(m)(1)(i), §63.11095(d)(1)(i))","Regulation(s) Covered by This Report\n(§60.505a(c), §63.428(m), §63.11095(d))","Address\n(§60.505a(c)(1)(ii), §63.428(m)(1)(ii), §63.11095(d)(1)(ii))","Address 2 ","City\n(§60.505a(c)(1)(ii), §63.428(m)(1)(ii), §63.11095(d)(1)(ii))","County\n(§60.505a(c)(1)(ii), §63.428(m)(1)(ii), §63.11095(d)(1)(ii))","State Abbreviation\n(§60.505a(c)(1)(ii), §63.428(m)(1)(ii), §63.11095(d)(1)(ii))\n(Select from dropdown)","Zip Code\n(§60.505a(c)(1)(ii), §63.428(m)(1)(ii), §63.11095(d)(1)(ii))","Responsible Agency Facility ID \n(State Facility Identifier)","Latitude\n(decimal degrees to at least five decimal places)\n(§60.505a(c)(1)(iii), §63.428(m)(1)(iii), §63.11095(d)(1)(iii))","Longitude\n(decimal degrees to at least five decimal places)\n(§60.505a(c)(1)(iii), §63.428(m)(1)(iii), §63.11095(d)(1)(iii))","Name\n(§60.505a(c)(1)(iv)(A), §63.428(m)(1)(iv)(A), §63.11095(d)(1)(iv)(A))","Mailing Address\n(§60.505a(c)(1)(iv)(B), §63.428(m)(1)(iv)(B), §63.11095(d)(1)(iv)(B))","City\n(§60.505a(c)(1)(iv)(B), §63.428(m)(1)(iv)(B), §63.11095(d)(1)(iv)(B))","State Abbreviation\n(§60.505a(c)(1)(iv)(B), §63.428(m)(1)(iv)(B), §63.11095(d)(1)(iv)(B))\n(Select from dropdown)","Zip Code\n(§60.505a(c)(1)(iv)(B), §63.428(m)(1)(iv)(B), §63.11095(d)(1)(iv)(B))","Telephone Number\n(§60.505a(c)(1)(iv)(C), §63.428(m)(1)(iv)(C), §63.11095(d)(1)(iv)(C))","E-mail Address\n(§60.505a(c)(1)(iv)(D), §63.428(m)(1)(iv)(D), §63.11095(d)(1)(iv)(D))","Beginning Date of Reporting Period \n(§60.505a(c)(1)(v), §63.428(m)(1)(vi), §63.11095(d)(1)(vi))","Ending Date of Reporting Period\n(§60.505a(c)(1)(v), §63.428(m)(1)(vi), §63.11095(d)(1)(vi))","Please enter any additional information.","Enter associated file name reference. "]
[null,"RecordId","FacilityName","Regulation","AddressLine1","AddressLine2","CityName","CountyName","StateName","ZipCode","StateFacId","SiteLatitude","SiteLongitude","ContactName","ContactAddress","ContactCity","ContactState","ContactZip","ContactNumber","ContactEmail","PeriodStartDate","PeriodEndDate","AddInfo","AddFile"]
[null,"e.g.: 1","e.g.: ABC Facility","e.g.: NESHAP R only","e.g.: 123 Main Street","e.g.: Suite 100","e.g.: Brooklyn","e.g.: Kings","e.g.: NY","e.g.: 11221","e.g.: AI 555","e.g.: 34.12345","e.g.: -101.12345","e.g.: John Doe","e.g.: P.O. Box 123","e.g.: Brooklyn","e.g.: NY","e.g.: 11221","e.g.: (555) 555-5555","e.g.: johndoe@company.xyz","e.g.: 01/01/23","e.g.: 06/30/23","e.g.:","e.g.: addinfo.zip"]
[null,"e.g.:","e.g.:",null,"e.g.:","e.g.:","e.g.:","e.g.:","e.g.:","e.g.:","e.g.:","e.g.:","e.g.:","e.g.:","e.g.:","e.g.:","e.g.:","e.g.:","e.g.:","e.g.:","e.g.:","e.g.:","e.g.:","e.g.:"]
[null,"e.g.:","e.g.:",null,"e.g.:","e.g.:","e.g.:","e.g.:","e.g.:","e.g.:","e.g.:","e.g.:","e.g.:","e.g.:","e.g.:","e.g.:","e.g.:","e.g.:","e.g.:","e.g.:","e.g.:","e.g.:","e.g.:","e.g.:"]
[null,"e.g.:","e.g.:",null,"e.g.:","e.g.:","e.g.:","e.g.:","e.g.:","e.g.:","e.g.:","e.g.:","e.g.:","e.g.:","e.g.:","e.g.:","e.g.:","e.g.:","e.g.:","e.g.:","e.g.:","e.g.:","e.g.:","e.g.:"]
[null,"e.g.:","e.g.:",null,"e.g.:","e.g.:","e.g.:","e.g.:","e.g.:","e.g.:","e.g.:","e.g.:","e.g.:","e.g.:","e.g.:","e.g.:","e.g.:","e.g.:","e.g.:","e.g.:","e.g.:","e.g.:","e.g.:","e.g.:"]
[null,"e.g.:","e.g.:",null,"e.g.:","e.g.:","e.g.:","e.g.:","e.g.:","e.g.:","e.g.:","e.g.:","e.g.:","e.g.:","e.g.:","e.g.:","e.g.:","e.g.:","e.g.:","e.g.:","e.g.:","e.g.:","e.g.:","e.g.:"]
[null,"e.g.:","e.g.:",null,"e.g.:","e.g.:","e.g.:","e.g.:","e.g.:","e.g.:","e.g.:","e.g.:","e.g.:","e.g.:","e.g.:","e.g.:","e.g.:","e.g.:","e.g.:","e.g.:","e.g.:","e.g.:","e.g.:","e.g.:"]
[null,"e.g.:","e.g.:",null,"e.g.:","e.g.:","e.g.:","e.g.:","e.g.:","e.g.:","e.g.:","e.g.:","e.g.:","e.g.:","e.g.:","e.g.:","e.g.:","e.g.:","e.g.:","e.g.:","e.g.:","e.g.:","e.g.:","e.g.:"]
[null,"e.g.:","e.g.:",null,"e.g.:","e.g.:","e.g.:","e.g.:","e.g.:","e.g.:","e.g.:","e.g.:","e.g.:","e.g.:","e.g.:","e.g.:","e.g.:","e.g.:","e.g.:","e.g.:","e.g.:","e.g.:","e.g.:","e.g.:"]
[null,"e.g.:","e.g.:",null,"e.g.:","e.g.:","e.g.:","e.g.:","e.g.:","e.g.:","e.g.:","e.g.:","e.g.:","e.g.:","e.g.:","e.g.:","e.g.:","e.g.:","e.g.:","e.g.:","e.g.:","e.g.:","e.g.:","e.g.:"]
[null,{"$f":"IF(C24=\"\",\"\",ROW(B24)-23)","v":""}]
[null,{"$f":"IF(C25=\"\",\"\",ROW(B25)-23)","v":""}]
[null,""]
[null,""]
[null,""]
[null,""]
[null,""]
[null,""]
[null,""]
[null,""]
[null,""]
[null,""]
[null,""]
[null,""]
[null,""]
[null,""]
[null,""]
[null,""]
[null,""]
[null,""]
[null,""]
[null,""]
[null,""]
[null,""]
[null,""]
[null,""]
[null,""]
[null,""]
[null,""]
[null,""]
[null,""]
[null,""]
[null,""]
[null,""]
[null,""]
[null,""]
[null,""]
[null,""]
[null,""]
[null,""]
[null,""]
[null,""]
[null,""]
[null,""]
[null,""]
[null,""]
[null,""]
[null,""]
[null,""]
[null,""]
[null,""]
[null,""]
[null,""]
[null,""]
[null,""]
[null,""]
[null,""]
[null,""]
[null,""]
[null,""]
[null,""]
[null,""]
[null,""]
[null,""]
[null,""]
[null,{"$f":"IF(C89=\"\",\"\",ROW(B89)-23)","v":""}]
[null,""]
[null,""]
[null,""]
[null,""]
[null,""]
[null,""]
[null,""]
[null,""]
[null,""]
[null,""]
[null,""]
[null,""]
[null,""]
[null,""]
[null,""]
[null,""]
[null,""]
[null,""]
[null,""]
[null,""]
[null,""]
[null,""]
[null,""]
[null,""]
[null,""]
[null,""]
[null,""]
[null,""]
[null,""]
[null,""]
[null,""]
[null,""]
[null,""]
[null,""]
[null,""]
[null,""]
[null,""]
[null,""]
[null,""]
[null,""]
[null,""]
[null,""]
[null,""]
[null,""]
[null,""]
[null,""]
[null,""]
[null,""]
[null,""]
[null,""]
[null,""]
[null,""]
[null,""]
[null,""]
[null,""]
[null,""]
[null,""]
[null,""]
[null,""]
[null,""]
[null,""]
[null,""]
[null,""]
[null,{"$f":"IF(C153=\"\",\"\",ROW(B153)-23)","v":""}]
[null,""]
[null,""]
[null,""]
[null,""]
[null,""]
[null,""]
[null,""]
[null,""]
[null,""]
[null,""]
[null,""]
[null,""]
[null,""]
[null,""]
[null,""]
[null,""]
[null,""]
[null,""]
[null,""]
[null,""]
[null,""]
[null,""]
[null,""]
[null,""]
[null,""]
[null,""]
[null,""]
[null,""]
[null,""]
[null,""]
[null,""]
[null,""]
[null,""]
[null,""]
[null,""]
[null,""]
[null,""]
[null,""]
[null,""]
[null,""]
[null,""]
[null,""]
[null,""]
[null,""]
[null,""]
[null,""]
[null,""]
[null,""]
[null,""]
[null,""]
[null,""]
[null,""]
[null,""]
[null,""]
[null,""]
[null,""]
[null,""]
[null,""]
[null,""]

{"sheet":"General_Information","index":2,"n_rows":212,"n_cols":8,"rows_kept":212,"cut":false,"hidden":false,"merged":[]}
[null,"DO NOT REMOVE OR EDIT INFORMATION IN ROWS 1 THROUGH 5\nFOR INTERNAL USE ONLY"]
[null,"Template Name",{"$f":"Welcome!B2","v":"Gasoline Distribution Semiannual Reports (Spreadsheet Template)"}]
[null,"CitationID",{"$f":"Welcome!B3","v":"60.505a(c)"}]
[null,"Template Version",{"$f":"Welcome!B4","v":"draft"}]
[null,"Last Updated Date",{"$f":"Welcome!B5","v":"2023-09-28"}]
[]
[null,{"$f":"Facility_Information!B7","v":"40 CFR Part 60, Subpart XXa, 40 CFR Part 63, Subpart R, 40 CFR Part 63, Subpart BBBBBB - Gasoline Distribution"}]
[null,{"$f":"Facility_Information!B8","v":"§60.505a(c), §63.428(m), and §63.11095(d) Semiannual  Report Spreadsheet Template"}]
[null,"This worksheet contains general information and general declarations about each site. "]
[null,"Note: Facility Record No. appears automatically once a Facility(s) is added to the Facility_Information worksheet."]
[]
[null,"Facility Record No.\n(Autofilled)","Type of Facility\n(§63.428(m)(1)(v), §63.11095(d)(1)(v))","Leaks on Delay of Repair at Start of Reporting Period\n(§60.505a(c)(6)(iii), §63.428(m)(6)(iii), §63.11095(d)(7)(iii))","Leaks on Delay of Repair at End of Reporting Period\n(§60.505a(c)(6)(iv), §63.428(m)(6)(iv), §63.11095(d)(7)(iv))","Were there deviations from the emission limitations, operating parameters, or work practice standards?\n(§60.505a(c)(7), §63.428(m)(8), §63.11095(d)(9))","Were there periods during which a continuous monitoring system (including a CEMS or CPMS) was inoperable or out-of-control?\n(§60.505a(c)(7), §63.428(m)(8), §63.11095(d)(9))","List the name of the attachment with the information specified in §60.115b or §63.1066(b) for each gasoline storage vessel subject to requirements in §63.423 or item 2 of Table 1 of 40 CFR part 63 subpart BBBBBB.\n(§63.428(m)(7)(i), §63.11095(d)(8)(i))"]
[null,{"$f":"IF(Table1[[#This Row],[Facility Record No.\n(Field value will automatically generate if a value is not entered.)]]=\"\",\"\",Table1[[#This Row],[Facility Record No.\n(Field value will automatically generate if a value is not entered.)]])","v":"RecordId"},"FacType","DelayNoPeriodStart","DelayNoPeriodEnd","PeriodDeviationFlag","CMSOutOfControlFlag","TankAttach"]
[null,{"$f":"IF(Table1[[#This Row],[Facility Record No.\n(Field value will automatically generate if a value is not entered.)]]=\"\",\"\",Table1[[#This Row],[Facility Record No.\n(Field value will automatically generate if a value is not entered.)]])","v":"e.g.: 1"},"e.g.: pipeline breakout station","e.g.: 2","e.g.: 0","e.g.: There were no deviations from the emission limitations or loading pressure requirements during the reporting period.","e.g.: Yes","e.g.: N/A"]
[null,"e.g.: 2","e.g.: bulk gasoline terminal < 250,000 gallons/day, gasoline throughput (total of all racks) ","e.g.: 1","e.g.: 1","e.g.: Yes","e.g.: There were no periods during which a continuous monitoring system was inoperable or out-of-control during the reporting period.","e.g.: storagevessel.pdf"]
[null,{"$f":"IF(Table1[[#This Row],[Facility Record No.\n(Field value will automatically generate if a value is not entered.)]]=\"\",\"\",Table1[[#This Row],[Facility Record No.\n(Field value will automatically generate if a value is not entered.)]])","v":"e.g.:"},{"$f":"IF(Table1[[#This Row],[Facility Name\n(§60.505a(c)(1)(i), §63.428(m)(1)(i), §63.11095(d)(1)(i))]]=\"\",\"\",Table1[[#This Row],[Facility Name\n(§60.505a(c)(1)(i), §63.428(m)(1)(i), §63.11095(d)(1)(i))]])","v":"e.g.:"},{"$f":"IF(Table1[[#This Row],[Address\n(§60.505a(c)(1)(ii), §63.428(m)(1)(ii), §63.11095(d)(1)(ii))]]=\"\",\"\",Table1[[#This Row],[Address\n(§60.505a(c)(1)(ii), §63.428(m)(1)(ii), §63.11095(d)(1)(ii))]])","v":"e.g.:"},{"$f":"IF(Table1[[#This Row],[Address 2 ]]=\"\",\"\",Table1[[#This Row],[Address 2 ]])","v":"e.g.:"},{"$f":"IF(Table1[[#This Row],[County\n(§60.505a(c)(1)(ii), §63.428(m)(1)(ii), §63.11095(d)(1)(ii))]]=\"\",\"\",Table1[[#This Row],[County\n(§60.505a(c)(1)(ii), §63.428(m)(1)(ii), §63.11095(d)(1)(ii))]])","v":"e.g.:"},{"$f":"IF(Table1[[#This Row],[Facility Name\n(§60.505a(c)(1)(i), §63.428(m)(1)(i), §63.11095(d)(1)(i))]]=\"\",\"\",Table1[[#This Row],[Facility Name\n(§60.505a(c)(1)(i), §63.428(m)(1)(i), §63.11095(d)(1)(i))]])","v":"e.g.:"},{"$f":"IF(Table1[[#This Row],[Address\n(§60.505a(c)(1)(ii), §63.428(m)(1)(ii), §63.11095(d)(1)(ii))]]=\"\",\"\",Table1[[#This Row],[Address\n(§60.505a(c)(1)(ii), §63.428(m)(1)(ii), §63.11095(d)(1)(ii))]])","v":"e.g.:"}]
[null,{"$f":"IF(Table1[[#This Row],[Facility Record No.\n(Field value will automatically generate if a value is not entered.)]]=\"\",\"\",Table1[[#This Row],[Facility Record No.\n(Field value will automatically generate if a value is not entered.)]])","v":"e.g.:"},{"$f":"IF(Table1[[#This Row],[Facility Name\n(§60.505a(c)(1)(i), §63.428(m)(1)(i), §63.11095(d)(1)(i))]]=\"\",\"\",Table1[[#This Row],[Facility Name\n(§60.505a(c)(1)(i), §63.428(m)(1)(i), §63.11095(d)(1)(i))]])","v":"e.g.:"},{"$f":"IF(Table1[[#This Row],[Address\n(§60.505a(c)(1)(ii), §63.428(m)(1)(ii), §63.11095(d)(1)(ii))]]=\"\",\"\",Table1[[#This Row],[Address\n(§60.505a(c)(1)(ii), §63.428(m)(1)(ii), §63.11095(d)(1)(ii))]])","v":"e.g.:"},{"$f":"IF(Table1[[#This Row],[Address 2 ]]=\"\",\"\",Table1[[#This Row],[Address 2 ]])","v":"e.g.:"},{"$f":"IF(Table1[[#This Row],[County\n(§60.505a(c)(1)(ii), §63.428(m)(1)(ii), §63.11095(d)(1)(ii))]]=\"\",\"\",Table1[[#This Row],[County\n(§60.505a(c)(1)(ii), §63.428(m)(1)(ii), §63.11095(d)(1)(ii))]])","v":"e.g.:"},{"$f":"IF(Table1[[#This Row],[Facility Name\n(§60.505a(c)(1)(i), §63.428(m)(1)(i), §63.11095(d)(1)(i))]]=\"\",\"\",Table1[[#This Row],[Facility Name\n(§60.505a(c)(1)(i), §63.428(m)(1)(i), §63.11095(d)(1)(i))]])","v":"e.g.:"},{"$f":"IF(Table1[[#This Row],[Address\n(§60.505a(c)(1)(ii), §63.428(m)(1)(ii), §63.11095(d)(1)(ii))]]=\"\",\"\",Table1[[#This Row],[Address\n(§60.505a(c)(1)(ii), §63.428(m)(1)(ii), §63.11095(d)(1)(ii))]])","v":"e.g.:"}]
[null,{"$f":"IF(Table1[[#This Row],[Facility Record No.\n(Field value will automatically generate if a value is not entered.)]]=\"\",\"\",Table1[[#This Row],[Facility Record No.\n(Field value will automatically generate if a value is not entered.)]])","v":"e.g.:"},{"$f":"IF(Table1[[#This Row],[Facility Name\n(§60.505a(c)(1)(i), §63.428(m)(1)(i), §63.11095(d)(1)(i))]]=\"\",\"\",Table1[[#This Row],[Facility Name\n(§60.505a(c)(1)(i), §63.428(m)(1)(i), §63.11095(d)(1)(i))]])","v":"e.g.:"},{"$f":"IF(Table1[[#This Row],[Address\n(§60.505a(c)(1)(ii), §63.428(m)(1)(ii), §63.11095(d)(1)(ii))]]=\"\",\"\",Table1[[#This Row],[Address\n(§60.505a(c)(1)(ii), §63.428(m)(1)(ii), §63.11095(d)(1)(ii))]])","v":"e.g.:"},{"$f":"IF(Table1[[#This Row],[Address 2 ]]=\"\",\"\",Table1[[#This Row],[Address 2 ]])","v":"e.g.:"},{"$f":"IF(Table1[[#This Row],[County\n(§60.505a(c)(1)(ii), §63.428(m)(1)(ii), §63.11095(d)(1)(ii))]]=\"\",\"\",Table1[[#This Row],[County\n(§60.505a(c)(1)(ii), §63.428(m)(1)(ii), §63.11095(d)(1)(ii))]])","v":"e.g.:"},{"$f":"IF(Table1[[#This Row],[Facility Name\n(§60.505a(c)(1)(i), §63.428(m)(1)(i), §63.11095(d)(1)(i))]]=\"\",\"\",Table1[[#This Row],[Facility Name\n(§60.505a(c)(1)(i), §63.428(m)(1)(i), §63.11095(d)(1)(i))]])","v":"e.g.:"},{"$f":"IF(Table1[[#This Row],[Address\n(§60.505a(c)(1)(ii), §63.428(m)(1)(ii), §63.11095(d)(1)(ii))]]=\"\",\"\",Table1[[#This Row],[Address\n(§60.505a(c)(1)(ii), §63.428(m)(1)(ii), §63.11095(d)(1)(ii))]])","v":"e.g.:"}]
[null,{"$f":"IF(Table1[[#This Row],[Facility Record No.\n(Field value will automatically generate if a value is not entered.)]]=\"\",\"\",Table1[[#This Row],[Facility Record No.\n(Field value will automatically generate if a value is not entered.)]])","v":"e.g.:"},{"$f":"IF(Table1[[#This Row],[Facility Name\n(§60.505a(c)(1)(i), §63.428(m)(1)(i), §63.11095(d)(1)(i))]]=\"\",\"\",Table1[[#This Row],[Facility Name\n(§60.505a(c)(1)(i), §63.428(m)(1)(i), §63.11095(d)(1)(i))]])","v":"e.g.:"},{"$f":"IF(Table1[[#This Row],[Address\n(§60.505a(c)(1)(ii), §63.428(m)(1)(ii), §63.11095(d)(1)(ii))]]=\"\",\"\",Table1[[#This Row],[Address\n(§60.505a(c)(1)(ii), §63.428(m)(1)(ii), §63.11095(d)(1)(ii))]])","v":"e.g.:"},{"$f":"IF(Table1[[#This Row],[Address 2 ]]=\"\",\"\",Table1[[#This Row],[Address 2 ]])","v":"e.g.:"},{"$f":"IF(Table1[[#This Row],[County\n(§60.505a(c)(1)(ii), §63.428(m)(1)(ii), §63.11095(d)(1)(ii))]]=\"\",\"\",Table1[[#This Row],[County\n(§60.505a(c)(1)(ii), §63.428(m)(1)(ii), §63.11095(d)(1)(ii))]])","v":"e.g.:"},{"$f":"IF(Table1[[#This Row],[Facility Name\n(§60.505a(c)(1)(i), §63.428(m)(1)(i), §63.11095(d)(1)(i))]]=\"\",\"\",Table1[[#This Row],[Facility Name\n(§60.505a(c)(1)(i), §63.428(m)(1)(i), §63.11095(d)(1)(i))]])","v":"e.g.:"},{"$f":"IF(Table1[[#This Row],[Address\n(§60.505a(c)(1)(ii), §63.428(m)(1)(ii), §63.11095(d)(1)(ii))]]=\"\",\"\",Table1[[#This Row],[Address\n(§60.505a(c)(1)(ii), §63.428(m)(1)(ii), §63.11095(d)(1)(ii))]])","v":"e.g.:"}]
[null,{"$f":"IF(Table1[[#This Row],[Facility Record No.\n(Field value will automatically generate if a value is not entered.)]]=\"\",\"\",Table1[[#This Row],[Facility Record No.\n(Field value will automatically generate if a value is not entered.)]])","v":"e.g.:"},{"$f":"IF(Table1[[#This Row],[Facility Name\n(§60.505a(c)(1)(i), §63.428(m)(1)(i), §63.11095(d)(1)(i))]]=\"\",\"\",Table1[[#This Row],[Facility Name\n(§60.505a(c)(1)(i), §63.428(m)(1)(i), §63.11095(d)(1)(i))]])","v":"e.g.:"},{"$f":"IF(Table1[[#This Row],[Address\n(§60.505a(c)(1)(ii), §63.428(m)(1)(ii), §63.11095(d)(1)(ii))]]=\"\",\"\",Table1[[#This Row],[Address\n(§60.505a(c)(1)(ii), §63.428(m)(1)(ii), §63.11095(d)(1)(ii))]])","v":"e.g.:"},{"$f":"IF(Table1[[#This Row],[Address 2 ]]=\"\",\"\",Table1[[#This Row],[Address 2 ]])","v":"e.g.:"},{"$f":"IF(Table1[[#This Row],[County\n(§60.505a(c)(1)(ii), §63.428(m)(1)(ii), §63.11095(d)(1)(ii))]]=\"\",\"\",Table1[[#This Row],[County\n(§60.505a(c)(1)(ii), §63.428(m)(1)(ii), §63.11095(d)(1)(ii))]])","v":"e.g.:"},{"$f":"IF(Table1[[#This Row],[Facility Name\n(§60.505a(c)(1)(i), §63.428(m)(1)(i), §63.11095(d)(1)(i))]]=\"\",\"\",Table1[[#This Row],[Facility Name\n(§60.505a(c)(1)(i), §63.428(m)(1)(i), §63.11095(d)(1)(i))]])","v":"e.g.:"},{"$f":"IF(Table1[[#This Row],[Address\n(§60.505a(c)(1)(ii), §63.428(m)(1)(ii), §63.11095(d)(1)(ii))]]=\"\",\"\",Table1[[#This Row],[Address\n(§60.505a(c)(1)(ii), §63.428(m)(1)(ii), §63.11095(d)(1)(ii))]])","v":"e.g.:"}]
[null,{"$f":"IF(Table1[[#This Row],[Facility Record No.\n(Field value will automatically generate if a value is not entered.)]]=\"\",\"\",Table1[[#This Row],[Facility Record No.\n(Field value will automatically generate if a value is not entered.)]])","v":"e.g.:"},{"$f":"IF(Table1[[#This Row],[Facility Name\n(§60.505a(c)(1)(i), §63.428(m)(1)(i), §63.11095(d)(1)(i))]]=\"\",\"\",Table1[[#This Row],[Facility Name\n(§60.505a(c)(1)(i), §63.428(m)(1)(i), §63.11095(d)(1)(i))]])","v":"e.g.:"},{"$f":"IF(Table1[[#This Row],[Address\n(§60.505a(c)(1)(ii), §63.428(m)(1)(ii), §63.11095(d)(1)(ii))]]=\"\",\"\",Table1[[#This Row],[Address\n(§60.505a(c)(1)(ii), §63.428(m)(1)(ii), §63.11095(d)(1)(ii))]])","v":"e.g.:"},{"$f":"IF(Table1[[#This Row],[Address 2 ]]=\"\",\"\",Table1[[#This Row],[Address 2 ]])","v":"e.g.:"},{"$f":"IF(Table1[[#This Row],[County\n(§60.505a(c)(1)(ii), §63.428(m)(1)(ii), §63.11095(d)(1)(ii))]]=\"\",\"\",Table1[[#This Row],[County\n(§60.505a(c)(1)(ii), §63.428(m)(1)(ii), §63.11095(d)(1)(ii))]])","v":"e.g.:"},{"$f":"IF(Table1[[#This Row],[Facility Name\n(§60.505a(c)(1)(i), §63.428(m)(1)(i), §63.11095(d)(1)(i))]]=\"\",\"\",Table1[[#This Row],[Facility Name\n(§60.505a(c)(1)(i), §63.428(m)(1)(i), §63.11095(d)(1)(i))]])","v":"e.g.:"},{"$f":"IF(Table1[[#This Row],[Address\n(§60.505a(c)(1)(ii), §63.428(m)(1)(ii), §63.11095(d)(1)(ii))]]=\"\",\"\",Table1[[#This Row],[Address\n(§60.505a(c)(1)(ii), §63.428(m)(1)(ii), §63.11095(d)(1)(ii))]])","v":"e.g.:"}]
[null,{"$f":"IF(Table1[[#This Row],[Facility Record No.\n(Field value will automatically generate if a value is not entered.)]]=\"\",\"\",Table1[[#This Row],[Facility Record No.\n(Field value will automatically generate if a value is not entered.)]])","v":"e.g.:"},{"$f":"IF(Table1[[#This Row],[Facility Name\n(§60.505a(c)(1)(i), §63.428(m)(1)(i), §63.11095(d)(1)(i))]]=\"\",\"\",Table1[[#This Row],[Facility Name\n(§60.505a(c)(1)(i), §63.428(m)(1)(i), §63.11095(d)(1)(i))]])","v":"e.g.:"},{"$f":"IF(Table1[[#This Row],[Address\n(§60.505a(c)(1)(ii), §63.428(m)(1)(ii), §63.11095(d)(1)(ii))]]=\"\",\"\",Table1[[#This Row],[Address\n(§60.505a(c)(1)(ii), §63.428(m)(1)(ii), §63.11095(d)(1)(ii))]])","v":"e.g.:"},{"$f":"IF(Table1[[#This Row],[Address 2 ]]=\"\",\"\",Table1[[#This Row],[Address 2 ]])","v":"e.g.:"},{"$f":"IF(Table1[[#This Row],[County\n(§60.505a(c)(1)(ii), §63.428(m)(1)(ii), §63.11095(d)(1)(ii))]]=\"\",\"\",Table1[[#This Row],[County\n(§60.505a(c)(1)(ii), §63.428(m)(1)(ii), §63.11095(d)(1)(ii))]])","v":"e.g.:"},{"$f":"IF(Table1[[#This Row],[Facility Name\n(§60.505a(c)(1)(i), §63.428(m)(1)(i), §63.11095(d)(1)(i))]]=\"\",\"\",Table1[[#This Row],[Facility Name\n(§60.505a(c)(1)(i), §63.428(m)(1)(i), §63.11095(d)(1)(i))]])","v":"e.g.:"},{"$f":"IF(Table1[[#This Row],[Address\n(§60.505a(c)(1)(ii), §63.428(m)(1)(ii), §63.11095(d)(1)(ii))]]=\"\",\"\",Table1[[#This Row],[Address\n(§60.505a(c)(1)(ii), §63.428(m)(1)(ii), §63.11095(d)(1)(ii))]])","v":"e.g.:"}]
[null,{"$f":"IF(Table1[[#This Row],[Facility Record No.\n(Field value will automatically generate if a value is not entered.)]]=\"\",\"\",Table1[[#This Row],[Facility Record No.\n(Field value will automatically generate if a value is not entered.)]])","v":"e.g.:"},{"$f":"IF(Table1[[#This Row],[Facility Name\n(§60.505a(c)(1)(i), §63.428(m)(1)(i), §63.11095(d)(1)(i))]]=\"\",\"\",Table1[[#This Row],[Facility Name\n(§60.505a(c)(1)(i), §63.428(m)(1)(i), §63.11095(d)(1)(i))]])","v":"e.g.:"},{"$f":"IF(Table1[[#This Row],[Address\n(§60.505a(c)(1)(ii), §63.428(m)(1)(ii), §63.11095(d)(1)(ii))]]=\"\",\"\",Table1[[#This Row],[Address\n(§60.505a(c)(1)(ii), §63.428(m)(1)(ii), §63.11095(d)(1)(ii))]])","v":"e.g.:"},{"$f":"IF(Table1[[#This Row],[Address 2 ]]=\"\",\"\",Table1[[#This Row],[Address 2 ]])","v":"e.g.:"},{"$f":"IF(Table1[[#This Row],[County\n(§60.505a(c)(1)(ii), §63.428(m)(1)(ii), §63.11095(d)(1)(ii))]]=\"\",\"\",Table1[[#This Row],[County\n(§60.505a(c)(1)(ii), §63.428(m)(1)(ii), §63.11095(d)(1)(ii))]])","v":"e.g.:"},{"$f":"IF(Table1[[#This Row],[Facility Name\n(§60.505a(c)(1)(i), §63.428(m)(1)(i), §63.11095(d)(1)(i))]]=\"\",\"\",Table1[[#This Row],[Facility Name\n(§60.505a(c)(1)(i), §63.428(m)(1)(i), §63.11095(d)(1)(i))]])","v":"e.g.:"},{"$f":"IF(Table1[[#This Row],[Address\n(§60.505a(c)(1)(ii), §63.428(m)(1)(ii), §63.11095(d)(1)(ii))]]=\"\",\"\",Table1[[#This Row],[Address\n(§60.505a(c)(1)(ii), §63.428(m)(1)(ii), §63.11095(d)(1)(ii))]])","v":"e.g.:"}]
[null,{"$f":"IF(Table1[[#This Row],[Facility Record No.\n(Field value will automatically generate if a value is not entered.)]]=\"\",\"\",Table1[[#This Row],[Facility Record No.\n(Field value will automatically generate if a value is not entered.)]])","v":""}]
[null,{"$f":"IF(Table1[[#This Row],[Facility Record No.\n(Field value will automatically generate if a value is not entered.)]]=\"\",\"\",Table1[[#This Row],[Facility Record No.\n(Field value will automatically generate if a value is not entered.)]])","v":""}]
[null,{"$f":"IF(Table1[[#This Row],[Facility Record No.\n(Field value will automatically generate if a value is not entered.)]]=\"\",\"\",Table1[[#This Row],[Facility Record No.\n(Field value will automatically generate if a value is not entered.)]])","v":""}]
[null,{"$f":"IF(Table1[[#This Row],[Facility Record No.\n(Field value will automatically generate if a value is not entered.)]]=\"\",\"\",Table1[[#This Row],[Facility Record No.\n(Field value will automatically generate if a value is not entered.)]])","v":""}]
[null,{"$f":"IF(Table1[[#This Row],[Facility Record No.\n(Field value will automatically generate if a value is not entered.)]]=\"\",\"\",Table1[[#This Row],[Facility Record No.\n(Field value will automatically generate if a value is not entered.)]])","v":""}]
[null,{"$f":"IF(Table1[[#This Row],[Facility Record No.\n(Field value will automatically generate if a value is not entered.)]]=\"\",\"\",Table1[[#This Row],[Facility Record No.\n(Field value will automatically generate if a value is not entered.)]])","v":""}]
[null,{"$f":"IF(Table1[[#This Row],[Facility Record No.\n(Field value will automatically generate if a value is not entered.)]]=\"\",\"\",Table1[[#This Row],[Facility Record No.\n(Field value will automatically generate if a value is not entered.)]])","v":""}]
[null,{"$f":"IF(Table1[[#This Row],[Facility Record No.\n(Field value will automatically generate if a value is not entered.)]]=\"\",\"\",Table1[[#This Row],[Facility Record No.\n(Field value will automatically generate if a value is not entered.)]])","v":""}]
[null,{"$f":"IF(Table1[[#This Row],[Facility Record No.\n(Field value will automatically generate if a value is not entered.)]]=\"\",\"\",Table1[[#This Row],[Facility Record No.\n(Field value will automatically generate if a value is not entered.)]])","v":""}]
[null,{"$f":"IF(Table1[[#This Row],[Facility Record No.\n(Field value will automatically generate if a value is not entered.)]]=\"\",\"\",Table1[[#This Row],[Facility Record No.\n(Field value will automatically generate if a value is not entered.)]])","v":""}]
[null,{"$f":"IF(Table1[[#This Row],[Facility Record No.\n(Field value will automatically generate if a value is not entered.)]]=\"\",\"\",Table1[[#This Row],[Facility Record No.\n(Field value will automatically generate if a value is not entered.)]])","v":""}]
[null,{"$f":"IF(Table1[[#This Row],[Facility Record No.\n(Field value will automatically generate if a value is not entered.)]]=\"\",\"\",Table1[[#This Row],[Facility Record No.\n(Field value will automatically generate if a value is not entered.)]])","v":""}]
[null,{"$f":"IF(Table1[[#This Row],[Facility Record No.\n(Field value will automatically generate if a value is not entered.)]]=\"\",\"\",Table1[[#This Row],[Facility Record No.\n(Field value will automatically generate if a value is not entered.)]])","v":""}]
[null,{"$f":"IF(Table1[[#This Row],[Facility Record No.\n(Field value will automatically generate if a value is not entered.)]]=\"\",\"\",Table1[[#This Row],[Facility Record No.\n(Field value will automatically generate if a value is not entered.)]])","v":""}]
[null,{"$f":"IF(Table1[[#This Row],[Facility Record No.\n(Field value will automatically generate if a value is not entered.)]]=\"\",\"\",Table1[[#This Row],[Facility Record No.\n(Field value will automatically generate if a value is not entered.)]])","v":""}]
[null,{"$f":"IF(Table1[[#This Row],[Facility Record No.\n(Field value will automatically generate if a value is not entered.)]]=\"\",\"\",Table1[[#This Row],[Facility Record No.\n(Field value will automatically generate if a value is not entered.)]])","v":""}]
[null,{"$f":"IF(Table1[[#This Row],[Facility Record No.\n(Field value will automatically generate if a value is not entered.)]]=\"\",\"\",Table1[[#This Row],[Facility Record No.\n(Field value will automatically generate if a value is not entered.)]])","v":""}]
[null,{"$f":"IF(Table1[[#This Row],[Facility Record No.\n(Field value will automatically generate if a value is not entered.)]]=\"\",\"\",Table1[[#This Row],[Facility Record No.\n(Field value will automatically generate if a value is not entered.)]])","v":""}]
[null,{"$f":"IF(Table1[[#This Row],[Facility Record No.\n(Field value will automatically generate if a value is not entered.)]]=\"\",\"\",Table1[[#This Row],[Facility Record No.\n(Field value will automatically generate if a value is not entered.)]])","v":""}]
[null,{"$f":"IF(Table1[[#This Row],[Facility Record No.\n(Field value will automatically generate if a value is not entered.)]]=\"\",\"\",Table1[[#This Row],[Facility Record No.\n(Field value will automatically generate if a value is not entered.)]])","v":""}]
[null,{"$f":"IF(Table1[[#This Row],[Facility Record No.\n(Field value will automatically generate if a value is not entered.)]]=\"\",\"\",Table1[[#This Row],[Facility Record No.\n(Field value will automatically generate if a value is not entered.)]])","v":""}]
[null,{"$f":"IF(Table1[[#This Row],[Facility Record No.\n(Field value will automatically generate if a value is not entered.)]]=\"\",\"\",Table1[[#This Row],[Facility Record No.\n(Field value will automatically generate if a value is not entered.)]])","v":""}]
[null,{"$f":"IF(Table1[[#This Row],[Facility Record No.\n(Field value will automatically generate if a value is not entered.)]]=\"\",\"\",Table1[[#This Row],[Facility Record No.\n(Field value will automatically generate if a value is not entered.)]])","v":""}]
[null,{"$f":"IF(Table1[[#This Row],[Facility Record No.\n(Field value will automatically generate if a value is not entered.)]]=\"\",\"\",Table1[[#This Row],[Facility Record No.\n(Field value will automatically generate if a value is not entered.)]])","v":""}]
[null,{"$f":"IF(Table1[[#This Row],[Facility Record No.\n(Field value will automatically generate if a value is not entered.)]]=\"\",\"\",Table1[[#This Row],[Facility Record No.\n(Field value will automatically generate if a value is not entered.)]])","v":""}]
[null,{"$f":"IF(Table1[[#This Row],[Facility Record No.\n(Field value will automatically generate if a value is not entered.)]]=\"\",\"\",Table1[[#This Row],[Facility Record No.\n(Field value will automatically generate if a value is not entered.)]])","v":""}]
[null,{"$f":"IF(Table1[[#This Row],[Facility Record No.\n(Field value will automatically generate if a value is not entered.)]]=\"\",\"\",Table1[[#This Row],[Facility Record No.\n(Field value will automatically generate if a value is not entered.)]])","v":""}]
[null,{"$f":"IF(Table1[[#This Row],[Facility Record No.\n(Field value will automatically generate if a value is not entered.)]]=\"\",\"\",Table1[[#This Row],[Facility Record No.\n(Field value will automatically generate if a value is not entered.)]])","v":""}]
[null,{"$f":"IF(Table1[[#This Row],[Facility Record No.\n(Field value will automatically generate if a value is not entered.)]]=\"\",\"\",Table1[[#This Row],[Facility Record No.\n(Field value will automatically generate if a value is not entered.)]])","v":""}]
[null,{"$f":"IF(Table1[[#This Row],[Facility Record No.\n(Field value will automatically generate if a value is not entered.)]]=\"\",\"\",Table1[[#This Row],[Facility Record No.\n(Field value will automatically generate if a value is not entered.)]])","v":""}]
[null,{"$f":"IF(Table1[[#This Row],[Facility Record No.\n(Field value will automatically generate if a value is not entered.)]]=\"\",\"\",Table1[[#This Row],[Facility Record No.\n(Field value will automatically generate if a value is not entered.)]])","v":""}]
[null,{"$f":"IF(Table1[[#This Row],[Facility Record No.\n(Field value will automatically generate if a value is not entered.)]]=\"\",\"\",Table1[[#This Row],[Facility Record No.\n(Field value will automatically generate if a value is not entered.)]])","v":""}]
[null,{"$f":"IF(Table1[[#This Row],[Facility Record No.\n(Field value will automatically generate if a value is not entered.)]]=\"\",\"\",Table1[[#This Row],[Facility Record No.\n(Field value will automatically generate if a value is not entered.)]])","v":""}]
[null,{"$f":"IF(Table1[[#This Row],[Facility Record No.\n(Field value will automatically generate if a value is not entered.)]]=\"\",\"\",Table1[[#This Row],[Facility Record No.\n(Field value will automatically generate if a value is not entered.)]])","v":""}]
[null,{"$f":"IF(Table1[[#This Row],[Facility Record No.\n(Field value will automatically generate if a value is not entered.)]]=\"\",\"\",Table1[[#This Row],[Facility Record No.\n(Field value will automatically generate if a value is not entered.)]])","v":""}]
[null,{"$f":"IF(Table1[[#This Row],[Facility Record No.\n(Field value will automatically generate if a value is not entered.)]]=\"\",\"\",Table1[[#This Row],[Facility Record No.\n(Field value will automatically generate if a value is not entered.)]])","v":""}]
[null,{"$f":"IF(Table1[[#This Row],[Facility Record No.\n(Field value will automatically generate if a value is not entered.)]]=\"\",\"\",Table1[[#This Row],[Facility Record No.\n(Field value will automatically generate if a value is not entered.)]])","v":""}]
[null,{"$f":"IF(Table1[[#This Row],[Facility Record No.\n(Field value will automatically generate if a value is not entered.)]]=\"\",\"\",Table1[[#This Row],[Facility Record No.\n(Field value will automatically generate if a value is not entered.)]])","v":""}]
[null,{"$f":"IF(Table1[[#This Row],[Facility Record No.\n(Field value will automatically generate if a value is not entered.)]]=\"\",\"\",Table1[[#This Row],[Facility Record No.\n(Field value will automatically generate if a value is not entered.)]])","v":""}]
[null,{"$f":"IF(Table1[[#This Row],[Facility Record No.\n(Field value will automatically generate if a value is not entered.)]]=\"\",\"\",Table1[[#This Row],[Facility Record No.\n(Field value will automatically generate if a value is not entered.)]])","v":""}]
[null,{"$f":"IF(Table1[[#This Row],[Facility Record No.\n(Field value will automatically generate if a value is not entered.)]]=\"\",\"\",Table1[[#This Row],[Facility Record No.\n(Field value will automatically generate if a value is not entered.)]])","v":""}]
[null,{"$f":"IF(Table1[[#This Row],[Facility Record No.\n(Field value will automatically generate if a value is not entered.)]]=\"\",\"\",Table1[[#This Row],[Facility Record No.\n(Field value will automatically generate if a value is not entered.)]])","v":""}]
[null,{"$f":"IF(Table1[[#This Row],[Facility Record No.\n(Field value will automatically generate if a value is not entered.)]]=\"\",\"\",Table1[[#This Row],[Facility Record No.\n(Field value will automatically generate if a value is not entered.)]])","v":""}]
[null,{"$f":"IF(Table1[[#This Row],[Facility Record No.\n(Field value will automatically generate if a value is not entered.)]]=\"\",\"\",Table1[[#This Row],[Facility Record No.\n(Field value will automatically generate if a value is not entered.)]])","v":""}]
[null,{"$f":"IF(Table1[[#This Row],[Facility Record No.\n(Field value will automatically generate if a value is not entered.)]]=\"\",\"\",Table1[[#This Row],[Facility Record No.\n(Field value will automatically generate if a value is not entered.)]])","v":""}]
[null,{"$f":"IF(Table1[[#This Row],[Facility Record No.\n(Field value will automatically generate if a value is not entered.)]]=\"\",\"\",Table1[[#This Row],[Facility Record No.\n(Field value will automatically generate if a value is not entered.)]])","v":""}]
[null,{"$f":"IF(Table1[[#This Row],[Facility Record No.\n(Field value will automatically generate if a value is not entered.)]]=\"\",\"\",Table1[[#This Row],[Facility Record No.\n(Field value will automatically generate if a value is not entered.)]])","v":""}]
[null,{"$f":"IF(Table1[[#This Row],[Facility Record No.\n(Field value will automatically generate if a value is not entered.)]]=\"\",\"\",Table1[[#This Row],[Facility Record No.\n(Field value will automatically generate if a value is not entered.)]])","v":""}]
[null,{"$f":"IF(Table1[[#This Row],[Facility Record No.\n(Field value will automatically generate if a value is not entered.)]]=\"\",\"\",Table1[[#This Row],[Facility Record No.\n(Field value will automatically generate if a value is not entered.)]])","v":""}]
[null,{"$f":"IF(Table1[[#This Row],[Facility Record No.\n(Field value will automatically generate if a value is not entered.)]]=\"\",\"\",Table1[[#This Row],[Facility Record No.\n(Field value will automatically generate if a value is not entered.)]])","v":""}]
[null,{"$f":"IF(Table1[[#This Row],[Facility Record No.\n(Field value will automatically generate if a value is not entered.)]]=\"\",\"\",Table1[[#This Row],[Facility Record No.\n(Field value will automatically generate if a value is not entered.)]])","v":""}]
[null,{"$f":"IF(Table1[[#This Row],[Facility Record No.\n(Field value will automatically generate if a value is not entered.)]]=\"\",\"\",Table1[[#This Row],[Facility Record No.\n(Field value will automatically generate if a value is not entered.)]])","v":""}]
[null,{"$f":"IF(Table1[[#This Row],[Facility Record No.\n(Field value will automatically generate if a value is not entered.)]]=\"\",\"\",Table1[[#This Row],[Facility Record No.\n(Field value will automatically generate if a value is not entered.)]])","v":""}]
[null,{"$f":"IF(Table1[[#This Row],[Facility Record No.\n(Field value will automatically generate if a value is not entered.)]]=\"\",\"\",Table1[[#This Row],[Facility Record No.\n(Field value will automatically generate if a value is not entered.)]])","v":""}]
[null,{"$f":"IF(Table1[[#This Row],[Facility Record No.\n(Field value will automatically generate if a value is not entered.)]]=\"\",\"\",Table1[[#This Row],[Facility Record No.\n(Field value will automatically generate if a value is not entered.)]])","v":""}]
[null,{"$f":"IF(Table1[[#This Row],[Facility Record No.\n(Field value will automatically generate if a value is not entered.)]]=\"\",\"\",Table1[[#This Row],[Facility Record No.\n(Field value will automatically generate if a value is not entered.)]])","v":""}]
[null,{"$f":"IF(Table1[[#This Row],[Facility Record No.\n(Field value will automatically generate if a value is not entered.)]]=\"\",\"\",Table1[[#This Row],[Facility Record No.\n(Field value will automatically generate if a value is not entered.)]])","v":""}]
[null,{"$f":"IF(Table1[[#This Row],[Facility Record No.\n(Field value will automatically generate if a value is not entered.)]]=\"\",\"\",Table1[[#This Row],[Facility Record No.\n(Field value will automatically generate if a value is not entered.)]])","v":""}]
[null,{"$f":"IF(Table1[[#This Row],[Facility Record No.\n(Field value will automatically generate if a value is not entered.)]]=\"\",\"\",Table1[[#This Row],[Facility Record No.\n(Field value will automatically generate if a value is not entered.)]])","v":""}]
[null,{"$f":"IF(Table1[[#This Row],[Facility Record No.\n(Field value will automatically generate if a value is not entered.)]]=\"\",\"\",Table1[[#This Row],[Facility Record No.\n(Field value will automatically generate if a value is not entered.)]])","v":""}]
[null,{"$f":"IF(Table1[[#This Row],[Facility Record No.\n(Field value will automatically generate if a value is not entered.)]]=\"\",\"\",Table1[[#This Row],[Facility Record No.\n(Field value will automatically generate if a value is not entered.)]])","v":""}]
[null,{"$f":"IF(Table1[[#This Row],[Facility Record No.\n(Field value will automatically generate if a value is not entered.)]]=\"\",\"\",Table1[[#This Row],[Facility Record No.\n(Field value will automatically generate if a value is not entered.)]])","v":""}]
[null,{"$f":"IF(Table1[[#This Row],[Facility Record No.\n(Field value will automatically generate if a value is not entered.)]]=\"\",\"\",Table1[[#This Row],[Facility Record No.\n(Field value will automatically generate if a value is not entered.)]])","v":""}]
[null,{"$f":"IF(Table1[[#This Row],[Facility Record No.\n(Field value will automatically generate if a value is not entered.)]]=\"\",\"\",Table1[[#This Row],[Facility Record No.\n(Field value will automatically generate if a value is not entered.)]])","v":""}]
[null,{"$f":"IF(Table1[[#This Row],[Facility Record No.\n(Field value will automatically generate if a value is not entered.)]]=\"\",\"\",Table1[[#This Row],[Facility Record No.\n(Field value will automatically generate if a value is not entered.)]])","v":""}]
[null,{"$f":"IF(Table1[[#This Row],[Facility Record No.\n(Field value will automatically generate if a value is not entered.)]]=\"\",\"\",Table1[[#This Row],[Facility Record No.\n(Field value will automatically generate if a value is not entered.)]])","v":""}]
[null,{"$f":"IF(Table1[[#This Row],[Facility Record No.\n(Field value will automatically generate if a value is not entered.)]]=\"\",\"\",Table1[[#This Row],[Facility Record No.\n(Field value will automatically generate if a value is not entered.)]])","v":""}]
[null,{"$f":"IF(Table1[[#This Row],[Facility Record No.\n(Field value will automatically generate if a value is not entered.)]]=\"\",\"\",Table1[[#This Row],[Facility Record No.\n(Field value will automatically generate if a value is not entered.)]])","v":""}]
[null,{"$f":"IF(Table1[[#This Row],[Facility Record No.\n(Field value will automatically generate if a value is not entered.)]]=\"\",\"\",Table1[[#This Row],[Facility Record No.\n(Field value will automatically generate if a value is not entered.)]])","v":""}]
[null,{"$f":"IF(Table1[[#This Row],[Facility Record No.\n(Field value will automatically generate if a value is not entered.)]]=\"\",\"\",Table1[[#This Row],[Facility Record No.\n(Field value will automatically generate if a value is not entered.)]])","v":""}]
[null,{"$f":"IF(Table1[[#This Row],[Facility Record No.\n(Field value will automatically generate if a value is not entered.)]]=\"\",\"\",Table1[[#This Row],[Facility Record No.\n(Field value will automatically generate if a value is not entered.)]])","v":""}]
[null,{"$f":"IF(Table1[[#This Row],[Facility Record No.\n(Field value will automatically generate if a value is not entered.)]]=\"\",\"\",Table1[[#This Row],[Facility Record No.\n(Field value will automatically generate if a value is not entered.)]])","v":""}]
[null,{"$f":"IF(Table1[[#This Row],[Facility Record No.\n(Field value will automatically generate if a value is not entered.)]]=\"\",\"\",Table1[[#This Row],[Facility Record No.\n(Field value will automatically generate if a value is not entered.)]])","v":""}]
[null,{"$f":"IF(Table1[[#This Row],[Facility Record No.\n(Field value will automatically generate if a value is not entered.)]]=\"\",\"\",Table1[[#This Row],[Facility Record No.\n(Field value will automatically generate if a value is not entered.)]])","v":""}]
[null,{"$f":"IF(Table1[[#This Row],[Facility Record No.\n(Field value will automatically generate if a value is not entered.)]]=\"\",\"\",Table1[[#This Row],[Facility Record No.\n(Field value will automatically generate if a value is not entered.)]])","v":""}]
[null,{"$f":"IF(Table1[[#This Row],[Facility Record No.\n(Field value will automatically generate if a value is not entered.)]]=\"\",\"\",Table1[[#This Row],[Facility Record No.\n(Field value will automatically generate if a value is not entered.)]])","v":""}]
[null,{"$f":"IF(Table1[[#This Row],[Facility Record No.\n(Field value will automatically generate if a value is not entered.)]]=\"\",\"\",Table1[[#This Row],[Facility Record No.\n(Field value will automatically generate if a value is not entered.)]])","v":""}]
[null,{"$f":"IF(Table1[[#This Row],[Facility Record No.\n(Field value will automatically generate if a value is not entered.)]]=\"\",\"\",Table1[[#This Row],[Facility Record No.\n(Field value will automatically generate if a value is not entered.)]])","v":""}]
[null,{"$f":"IF(Table1[[#This Row],[Facility Record No.\n(Field value will automatically generate if a value is not entered.)]]=\"\",\"\",Table1[[#This Row],[Facility Record No.\n(Field value will automatically generate if a value is not entered.)]])","v":""}]
[null,{"$f":"IF(Table1[[#This Row],[Facility Record No.\n(Field value will automatically generate if a value is not entered.)]]=\"\",\"\",Table1[[#This Row],[Facility Record No.\n(Field value will automatically generate if a value is not entered.)]])","v":""}]
[null,{"$f":"IF(Table1[[#This Row],[Facility Record No.\n(Field value will automatically generate if a value is not entered.)]]=\"\",\"\",Table1[[#This Row],[Facility Record No.\n(Field value will automatically generate if a value is not entered.)]])","v":""}]
[null,{"$f":"IF(Table1[[#This Row],[Facility Record No.\n(Field value will automatically generate if a value is not entered.)]]=\"\",\"\",Table1[[#This Row],[Facility Record No.\n(Field value will automatically generate if a value is not entered.)]])","v":""}]
[null,{"$f":"IF(Table1[[#This Row],[Facility Record No.\n(Field value will automatically generate if a value is not entered.)]]=\"\",\"\",Table1[[#This Row],[Facility Record No.\n(Field value will automatically generate if a value is not entered.)]])","v":""}]
[null,{"$f":"IF(Table1[[#This Row],[Facility Record No.\n(Field value will automatically generate if a value is not entered.)]]=\"\",\"\",Table1[[#This Row],[Facility Record No.\n(Field value will automatically generate if a value is not entered.)]])","v":""}]
[null,{"$f":"IF(Table1[[#This Row],[Facility Record No.\n(Field value will automatically generate if a value is not entered.)]]=\"\",\"\",Table1[[#This Row],[Facility Record No.\n(Field value will automatically generate if a value is not entered.)]])","v":""}]
[null,{"$f":"IF(Table1[[#This Row],[Facility Record No.\n(Field value will automatically generate if a value is not entered.)]]=\"\",\"\",Table1[[#This Row],[Facility Record No.\n(Field value will automatically generate if a value is not entered.)]])","v":""}]
[null,{"$f":"IF(Table1[[#This Row],[Facility Record No.\n(Field value will automatically generate if a value is not entered.)]]=\"\",\"\",Table1[[#This Row],[Facility Record No.\n(Field value will automatically generate if a value is not entered.)]])","v":""}]
[null,{"$f":"IF(Table1[[#This Row],[Facility Record No.\n(Field value will automatically generate if a value is not entered.)]]=\"\",\"\",Table1[[#This Row],[Facility Record No.\n(Field value will automatically generate if a value is not entered.)]])","v":""}]
[null,{"$f":"IF(Table1[[#This Row],[Facility Record No.\n(Field value will automatically generate if a value is not entered.)]]=\"\",\"\",Table1[[#This Row],[Facility Record No.\n(Field value will automatically generate if a value is not entered.)]])","v":""}]
[null,{"$f":"IF(Table1[[#This Row],[Facility Record No.\n(Field value will automatically generate if a value is not entered.)]]=\"\",\"\",Table1[[#This Row],[Facility Record No.\n(Field value will automatically generate if a value is not entered.)]])","v":""}]
[null,{"$f":"IF(Table1[[#This Row],[Facility Record No.\n(Field value will automatically generate if a value is not entered.)]]=\"\",\"\",Table1[[#This Row],[Facility Record No.\n(Field value will automatically generate if a value is not entered.)]])","v":""}]
[null,{"$f":"IF(Table1[[#This Row],[Facility Record No.\n(Field value will automatically generate if a value is not entered.)]]=\"\",\"\",Table1[[#This Row],[Facility Record No.\n(Field value will automatically generate if a value is not entered.)]])","v":""}]
[null,{"$f":"IF(Table1[[#This Row],[Facility Record No.\n(Field value will automatically generate if a value is not entered.)]]=\"\",\"\",Table1[[#This Row],[Facility Record No.\n(Field value will automatically generate if a value is not entered.)]])","v":""}]
[null,{"$f":"IF(Table1[[#This Row],[Facility Record No.\n(Field value will automatically generate if a value is not entered.)]]=\"\",\"\",Table1[[#This Row],[Facility Record No.\n(Field value will automatically generate if a value is not entered.)]])","v":""}]
[null,{"$f":"IF(Table1[[#This Row],[Facility Record No.\n(Field value will automatically generate if a value is not entered.)]]=\"\",\"\",Table1[[#This Row],[Facility Record No.\n(Field value will automatically generate if a value is not entered.)]])","v":""}]
[null,{"$f":"IF(Table1[[#This Row],[Facility Record No.\n(Field value will automatically generate if a value is not entered.)]]=\"\",\"\",Table1[[#This Row],[Facility Record No.\n(Field value will automatically generate if a value is not entered.)]])","v":""}]
[null,{"$f":"IF(Table1[[#This Row],[Facility Record No.\n(Field value will automatically generate if a value is not entered.)]]=\"\",\"\",Table1[[#This Row],[Facility Record No.\n(Field value will automatically generate if a value is not entered.)]])","v":""}]
[null,{"$f":"IF(Table1[[#This Row],[Facility Record No.\n(Field value will automatically generate if a value is not entered.)]]=\"\",\"\",Table1[[#This Row],[Facility Record No.\n(Field value will automatically generate if a value is not entered.)]])","v":""}]
[null,{"$f":"IF(Table1[[#This Row],[Facility Record No.\n(Field value will automatically generate if a value is not entered.)]]=\"\",\"\",Table1[[#This Row],[Facility Record No.\n(Field value will automatically generate if a value is not entered.)]])","v":""}]
[null,{"$f":"IF(Table1[[#This Row],[Facility Record No.\n(Field value will automatically generate if a value is not entered.)]]=\"\",\"\",Table1[[#This Row],[Facility Record No.\n(Field value will automatically generate if a value is not entered.)]])","v":""}]
[null,{"$f":"IF(Table1[[#This Row],[Facility Record No.\n(Field value will automatically generate if a value is not entered.)]]=\"\",\"\",Table1[[#This Row],[Facility Record No.\n(Field value will automatically generate if a value is not entered.)]])","v":""}]
[null,{"$f":"IF(Table1[[#This Row],[Facility Record No.\n(Field value will automatically generate if a value is not entered.)]]=\"\",\"\",Table1[[#This Row],[Facility Record No.\n(Field value will automatically generate if a value is not entered.)]])","v":""}]
[null,{"$f":"IF(Table1[[#This Row],[Facility Record No.\n(Field value will automatically generate if a value is not entered.)]]=\"\",\"\",Table1[[#This Row],[Facility Record No.\n(Field value will automatically generate if a value is not entered.)]])","v":""}]
[null,{"$f":"IF(Table1[[#This Row],[Facility Record No.\n(Field value will automatically generate if a value is not entered.)]]=\"\",\"\",Table1[[#This Row],[Facility Record No.\n(Field value will automatically generate if a value is not entered.)]])","v":""}]
[null,{"$f":"IF(Table1[[#This Row],[Facility Record No.\n(Field value will automatically generate if a value is not entered.)]]=\"\",\"\",Table1[[#This Row],[Facility Record No.\n(Field value will automatically generate if a value is not entered.)]])","v":""}]
[null,{"$f":"IF(Table1[[#This Row],[Facility Record No.\n(Field value will automatically generate if a value is not entered.)]]=\"\",\"\",Table1[[#This Row],[Facility Record No.\n(Field value will automatically generate if a value is not entered.)]])","v":""}]
[null,{"$f":"IF(Table1[[#This Row],[Facility Record No.\n(Field value will automatically generate if a value is not entered.)]]=\"\",\"\",Table1[[#This Row],[Facility Record No.\n(Field value will automatically generate if a value is not entered.)]])","v":""}]
[null,{"$f":"IF(Table1[[#This Row],[Facility Record No.\n(Field value will automatically generate if a value is not entered.)]]=\"\",\"\",Table1[[#This Row],[Facility Record No.\n(Field value will automatically generate if a value is not entered.)]])","v":""}]
[null,{"$f":"IF(Table1[[#This Row],[Facility Record No.\n(Field value will automatically generate if a value is not entered.)]]=\"\",\"\",Table1[[#This Row],[Facility Record No.\n(Field value will automatically generate if a value is not entered.)]])","v":""}]
[null,{"$f":"IF(Table1[[#This Row],[Facility Record No.\n(Field value will automatically generate if a value is not entered.)]]=\"\",\"\",Table1[[#This Row],[Facility Record No.\n(Field value will automatically generate if a value is not entered.)]])","v":""}]
[null,{"$f":"IF(Table1[[#This Row],[Facility Record No.\n(Field value will automatically generate if a value is not entered.)]]=\"\",\"\",Table1[[#This Row],[Facility Record No.\n(Field value will automatically generate if a value is not entered.)]])","v":""}]
[null,{"$f":"IF(Table1[[#This Row],[Facility Record No.\n(Field value will automatically generate if a value is not entered.)]]=\"\",\"\",Table1[[#This Row],[Facility Record No.\n(Field value will automatically generate if a value is not entered.)]])","v":""}]
[null,{"$f":"IF(Table1[[#This Row],[Facility Record No.\n(Field value will automatically generate if a value is not entered.)]]=\"\",\"\",Table1[[#This Row],[Facility Record No.\n(Field value will automatically generate if a value is not entered.)]])","v":""}]
[null,{"$f":"IF(Table1[[#This Row],[Facility Record No.\n(Field value will automatically generate if a value is not entered.)]]=\"\",\"\",Table1[[#This Row],[Facility Record No.\n(Field value will automatically generate if a value is not entered.)]])","v":""}]
[null,{"$f":"IF(Table1[[#This Row],[Facility Record No.\n(Field value will automatically generate if a value is not entered.)]]=\"\",\"\",Table1[[#This Row],[Facility Record No.\n(Field value will automatically generate if a value is not entered.)]])","v":""}]
[null,{"$f":"IF(Table1[[#This Row],[Facility Record No.\n(Field value will automatically generate if a value is not entered.)]]=\"\",\"\",Table1[[#This Row],[Facility Record No.\n(Field value will automatically generate if a value is not entered.)]])","v":""}]
[null,{"$f":"IF(Table1[[#This Row],[Facility Record No.\n(Field value will automatically generate if a value is not entered.)]]=\"\",\"\",Table1[[#This Row],[Facility Record No.\n(Field value will automatically generate if a value is not entered.)]])","v":""}]
[null,{"$f":"IF(Table1[[#This Row],[Facility Record No.\n(Field value will automatically generate if a value is not entered.)]]=\"\",\"\",Table1[[#This Row],[Facility Record No.\n(Field value will automatically generate if a value is not entered.)]])","v":""}]
[null,{"$f":"IF(Table1[[#This Row],[Facility Record No.\n(Field value will automatically generate if a value is not entered.)]]=\"\",\"\",Table1[[#This Row],[Facility Record No.\n(Field value will automatically generate if a value is not entered.)]])","v":""}]
[null,{"$f":"IF(Table1[[#This Row],[Facility Record No.\n(Field value will automatically generate if a value is not entered.)]]=\"\",\"\",Table1[[#This Row],[Facility Record No.\n(Field value will automatically generate if a value is not entered.)]])","v":""}]
[null,{"$f":"IF(Table1[[#This Row],[Facility Record No.\n(Field value will automatically generate if a value is not entered.)]]=\"\",\"\",Table1[[#This Row],[Facility Record No.\n(Field value will automatically generate if a value is not entered.)]])","v":""}]
[null,{"$f":"IF(Table1[[#This Row],[Facility Record No.\n(Field value will automatically generate if a value is not entered.)]]=\"\",\"\",Table1[[#This Row],[Facility Record No.\n(Field value will automatically generate if a value is not entered.)]])","v":""}]
[null,{"$f":"IF(Table1[[#This Row],[Facility Record No.\n(Field value will automatically generate if a value is not entered.)]]=\"\",\"\",Table1[[#This Row],[Facility Record No.\n(Field value will automatically generate if a value is not entered.)]])","v":""}]
[null,{"$f":"IF(Table1[[#This Row],[Facility Record No.\n(Field value will automatically generate if a value is not entered.)]]=\"\",\"\",Table1[[#This Row],[Facility Record No.\n(Field value will automatically generate if a value is not entered.)]])","v":""}]
[null,{"$f":"IF(Table1[[#This Row],[Facility Record No.\n(Field value will automatically generate if a value is not entered.)]]=\"\",\"\",Table1[[#This Row],[Facility Record No.\n(Field value will automatically generate if a value is not entered.)]])","v":""}]
[null,{"$f":"IF(Table1[[#This Row],[Facility Record No.\n(Field value will automatically generate if a value is not entered.)]]=\"\",\"\",Table1[[#This Row],[Facility Record No.\n(Field value will automatically generate if a value is not entered.)]])","v":""}]
[null,{"$f":"IF(Table1[[#This Row],[Facility Record No.\n(Field value will automatically generate if a value is not entered.)]]=\"\",\"\",Table1[[#This Row],[Facility Record No.\n(Field value will automatically generate if a value is not entered.)]])","v":""}]
[null,{"$f":"IF(Table1[[#This Row],[Facility Record No.\n(Field value will automatically generate if a value is not entered.)]]=\"\",\"\",Table1[[#This Row],[Facility Record No.\n(Field value will automatically generate if a value is not entered.)]])","v":""}]
[null,{"$f":"IF(Table1[[#This Row],[Facility Record No.\n(Field value will automatically generate if a value is not entered.)]]=\"\",\"\",Table1[[#This Row],[Facility Record No.\n(Field value will automatically generate if a value is not entered.)]])","v":""}]
[null,{"$f":"IF(Table1[[#This Row],[Facility Record No.\n(Field value will automatically generate if a value is not entered.)]]=\"\",\"\",Table1[[#This Row],[Facility Record No.\n(Field value will automatically generate if a value is not entered.)]])","v":""}]
[null,{"$f":"IF(Table1[[#This Row],[Facility Record No.\n(Field value will automatically generate if a value is not entered.)]]=\"\",\"\",Table1[[#This Row],[Facility Record No.\n(Field value will automatically generate if a value is not entered.)]])","v":""}]
[null,{"$f":"IF(Table1[[#This Row],[Facility Record No.\n(Field value will automatically generate if a value is not entered.)]]=\"\",\"\",Table1[[#This Row],[Facility Record No.\n(Field value will automatically generate if a value is not entered.)]])","v":""}]
[null,{"$f":"IF(Table1[[#This Row],[Facility Record No.\n(Field value will automatically generate if a value is not entered.)]]=\"\",\"\",Table1[[#This Row],[Facility Record No.\n(Field value will automatically generate if a value is not entered.)]])","v":""}]
[null,{"$f":"IF(Table1[[#This Row],[Facility Record No.\n(Field value will automatically generate if a value is not entered.)]]=\"\",\"\",Table1[[#This Row],[Facility Record No.\n(Field value will automatically generate if a value is not entered.)]])","v":""}]
[null,{"$f":"IF(Table1[[#This Row],[Facility Record No.\n(Field value will automatically generate if a value is not entered.)]]=\"\",\"\",Table1[[#This Row],[Facility Record No.\n(Field value will automatically generate if a value is not entered.)]])","v":""}]
[null,{"$f":"IF(Table1[[#This Row],[Facility Record No.\n(Field value will automatically generate if a value is not entered.)]]=\"\",\"\",Table1[[#This Row],[Facility Record No.\n(Field value will automatically generate if a value is not entered.)]])","v":""}]
[null,{"$f":"IF(Table1[[#This Row],[Facility Record No.\n(Field value will automatically generate if a value is not entered.)]]=\"\",\"\",Table1[[#This Row],[Facility Record No.\n(Field value will automatically generate if a value is not entered.)]])","v":""}]
[null,{"$f":"IF(Table1[[#This Row],[Facility Record No.\n(Field value will automatically generate if a value is not entered.)]]=\"\",\"\",Table1[[#This Row],[Facility Record No.\n(Field value will automatically generate if a value is not entered.)]])","v":""}]
[null,{"$f":"IF(Table1[[#This Row],[Facility Record No.\n(Field value will automatically generate if a value is not entered.)]]=\"\",\"\",Table1[[#This Row],[Facility Record No.\n(Field value will automatically generate if a value is not entered.)]])","v":""}]
[null,{"$f":"IF(Table1[[#This Row],[Facility Record No.\n(Field value will automatically generate if a value is not entered.)]]=\"\",\"\",Table1[[#This Row],[Facility Record No.\n(Field value will automatically generate if a value is not entered.)]])","v":""}]
[null,{"$f":"IF(Table1[[#This Row],[Facility Record No.\n(Field value will automatically generate if a value is not entered.)]]=\"\",\"\",Table1[[#This Row],[Facility Record No.\n(Field value will automatically generate if a value is not entered.)]])","v":""}]
[null,{"$f":"IF(Table1[[#This Row],[Facility Record No.\n(Field value will automatically generate if a value is not entered.)]]=\"\",\"\",Table1[[#This Row],[Facility Record No.\n(Field value will automatically generate if a value is not entered.)]])","v":""}]
[null,{"$f":"IF(Table1[[#This Row],[Facility Record No.\n(Field value will automatically generate if a value is not entered.)]]=\"\",\"\",Table1[[#This Row],[Facility Record No.\n(Field value will automatically generate if a value is not entered.)]])","v":""}]
[null,{"$f":"IF(Table1[[#This Row],[Facility Record No.\n(Field value will automatically generate if a value is not entered.)]]=\"\",\"\",Table1[[#This Row],[Facility Record No.\n(Field value will automatically generate if a value is not entered.)]])","v":""}]
[null,{"$f":"IF(Table1[[#This Row],[Facility Record No.\n(Field value will automatically generate if a value is not entered.)]]=\"\",\"\",Table1[[#This Row],[Facility Record No.\n(Field value will automatically generate if a value is not entered.)]])","v":""}]
[null,{"$f":"IF(Table1[[#This Row],[Facility Record No.\n(Field value will automatically generate if a value is not entered.)]]=\"\",\"\",Table1[[#This Row],[Facility Record No.\n(Field value will automatically generate if a value is not entered.)]])","v":""}]
[null,{"$f":"IF(Table1[[#This Row],[Facility Record No.\n(Field value will automatically generate if a value is not entered.)]]=\"\",\"\",Table1[[#This Row],[Facility Record No.\n(Field value will automatically generate if a value is not entered.)]])","v":""}]
[null,{"$f":"IF(Table1[[#This Row],[Facility Record No.\n(Field value will automatically generate if a value is not entered.)]]=\"\",\"\",Table1[[#This Row],[Facility Record No.\n(Field value will automatically generate if a value is not entered.)]])","v":""}]
[null,{"$f":"IF(Table1[[#This Row],[Facility Record No.\n(Field value will automatically generate if a value is not entered.)]]=\"\",\"\",Table1[[#This Row],[Facility Record No.\n(Field value will automatically generate if a value is not entered.)]])","v":""}]
[null,{"$f":"IF(Table1[[#This Row],[Facility Record No.\n(Field value will automatically generate if a value is not entered.)]]=\"\",\"\",Table1[[#This Row],[Facility Record No.\n(Field value will automatically generate if a value is not entered.)]])","v":""}]
[null,{"$f":"IF(Table1[[#This Row],[Facility Record No.\n(Field value will automatically generate if a value is not entered.)]]=\"\",\"\",Table1[[#This Row],[Facility Record No.\n(Field value will automatically generate if a value is not entered.)]])","v":""}]
[null,{"$f":"IF(Table1[[#This Row],[Facility Record No.\n(Field value will automatically generate if a value is not entered.)]]=\"\",\"\",Table1[[#This Row],[Facility Record No.\n(Field value will automatically generate if a value is not entered.)]])","v":""}]
[null,{"$f":"IF(Table1[[#This Row],[Facility Record No.\n(Field value will automatically generate if a value is not entered.)]]=\"\",\"\",Table1[[#This Row],[Facility Record No.\n(Field value will automatically generate if a value is not entered.)]])","v":""}]
[null,{"$f":"IF(Table1[[#This Row],[Facility Record No.\n(Field value will automatically generate if a value is not entered.)]]=\"\",\"\",Table1[[#This Row],[Facility Record No.\n(Field value will automatically generate if a value is not entered.)]])","v":""}]
[null,{"$f":"IF(Table1[[#This Row],[Facility Record No.\n(Field value will automatically generate if a value is not entered.)]]=\"\",\"\",Table1[[#This Row],[Facility Record No.\n(Field value will automatically generate if a value is not entered.)]])","v":""}]
[null,{"$f":"IF(Table1[[#This Row],[Facility Record No.\n(Field value will automatically generate if a value is not entered.)]]=\"\",\"\",Table1[[#This Row],[Facility Record No.\n(Field value will automatically generate if a value is not entered.)]])","v":""}]
[null,{"$f":"IF(Table1[[#This Row],[Facility Record No.\n(Field value will automatically generate if a value is not entered.)]]=\"\",\"\",Table1[[#This Row],[Facility Record No.\n(Field value will automatically generate if a value is not entered.)]])","v":""}]
[null,{"$f":"IF(Table1[[#This Row],[Facility Record No.\n(Field value will automatically generate if a value is not entered.)]]=\"\",\"\",Table1[[#This Row],[Facility Record No.\n(Field value will automatically generate if a value is not entered.)]])","v":""}]
[null,{"$f":"IF(Table1[[#This Row],[Facility Record No.\n(Field value will automatically generate if a value is not entered.)]]=\"\",\"\",Table1[[#This Row],[Facility Record No.\n(Field value will automatically generate if a value is not entered.)]])","v":""}]
[null,{"$f":"IF(Table1[[#This Row],[Facility Record No.\n(Field value will automatically generate if a value is not entered.)]]=\"\",\"\",Table1[[#This Row],[Facility Record No.\n(Field value will automatically generate if a value is not entered.)]])","v":""}]
[null,{"$f":"IF(Table1[[#This Row],[Facility Record No.\n(Field value will automatically generate if a value is not entered.)]]=\"\",\"\",Table1[[#This Row],[Facility Record No.\n(Field value will automatically generate if a value is not entered.)]])","v":""}]
[null,{"$f":"IF(Table1[[#This Row],[Facility Record No.\n(Field value will automatically generate if a value is not entered.)]]=\"\",\"\",Table1[[#This Row],[Facility Record No.\n(Field value will automatically generate if a value is not entered.)]])","v":""}]
[null,{"$f":"IF(Table1[[#This Row],[Facility Record No.\n(Field value will automatically generate if a value is not entered.)]]=\"\",\"\",Table1[[#This Row],[Facility Record No.\n(Field value will automatically generate if a value is not entered.)]])","v":""}]
[null,{"$f":"IF(Table1[[#This Row],[Facility Record No.\n(Field value will automatically generate if a value is not entered.)]]=\"\",\"\",Table1[[#This Row],[Facility Record No.\n(Field value will automatically generate if a value is not entered.)]])","v":""}]
[null,{"$f":"IF(Table1[[#This Row],[Facility Record No.\n(Field value will automatically generate if a value is not entered.)]]=\"\",\"\",Table1[[#This Row],[Facility Record No.\n(Field value will automatically generate if a value is not entered.)]])","v":""}]
[null,{"$f":"IF(Table1[[#This Row],[Facility Record No.\n(Field value will automatically generate if a value is not entered.)]]=\"\",\"\",Table1[[#This Row],[Facility Record No.\n(Field value will automatically generate if a value is not entered.)]])","v":""}]
[null,{"$f":"IF(Table1[[#This Row],[Facility Record No.\n(Field value will automatically generate if a value is not entered.)]]=\"\",\"\",Table1[[#This Row],[Facility Record No.\n(Field value will automatically generate if a value is not entered.)]])","v":""}]
[null,{"$f":"IF(Table1[[#This Row],[Facility Record No.\n(Field value will automatically generate if a value is not entered.)]]=\"\",\"\",Table1[[#This Row],[Facility Record No.\n(Field value will automatically generate if a value is not entered.)]])","v":""}]
[null,{"$f":"IF(Table1[[#This Row],[Facility Record No.\n(Field value will automatically generate if a value is not entered.)]]=\"\",\"\",Table1[[#This Row],[Facility Record No.\n(Field value will automatically generate if a value is not entered.)]])","v":""}]
[null,{"$f":"IF(Table1[[#This Row],[Facility Record No.\n(Field value will automatically generate if a value is not entered.)]]=\"\",\"\",Table1[[#This Row],[Facility Record No.\n(Field value will automatically generate if a value is not entered.)]])","v":""}]
[null,{"$f":"IF(Table1[[#This Row],[Facility Record No.\n(Field value will automatically generate if a value is not entered.)]]=\"\",\"\",Table1[[#This Row],[Facility Record No.\n(Field value will automatically generate if a value is not entered.)]])","v":""}]
[null,{"$f":"IF(Table1[[#This Row],[Facility Record No.\n(Field value will automatically generate if a value is not entered.)]]=\"\",\"\",Table1[[#This Row],[Facility Record No.\n(Field value will automatically generate if a value is not entered.)]])","v":""}]
[null,{"$f":"IF(Table1[[#This Row],[Facility Record No.\n(Field value will automatically generate if a value is not entered.)]]=\"\",\"\",Table1[[#This Row],[Facility Record No.\n(Field value will automatically generate if a value is not entered.)]])","v":""}]
[null,{"$f":"IF(Table1[[#This Row],[Facility Record No.\n(Field value will automatically generate if a value is not entered.)]]=\"\",\"\",Table1[[#This Row],[Facility Record No.\n(Field value will automatically generate if a value is not entered.)]])","v":""}]
[null,{"$f":"IF(Table1[[#This Row],[Facility Record No.\n(Field value will automatically generate if a value is not entered.)]]=\"\",\"\",Table1[[#This Row],[Facility Record No.\n(Field value will automatically generate if a value is not entered.)]])","v":""}]
[null,{"$f":"IF(Table1[[#This Row],[Facility Record No.\n(Field value will automatically generate if a value is not entered.)]]=\"\",\"\",Table1[[#This Row],[Facility Record No.\n(Field value will automatically generate if a value is not entered.)]])","v":""}]
[null,{"$f":"IF(Table1[[#This Row],[Facility Record No.\n(Field value will automatically generate if a value is not entered.)]]=\"\",\"\",Table1[[#This Row],[Facility Record No.\n(Field value will automatically generate if a value is not entered.)]])","v":""}]
[null,{"$f":"IF(Table1[[#This Row],[Facility Record No.\n(Field value will automatically generate if a value is not entered.)]]=\"\",\"\",Table1[[#This Row],[Facility Record No.\n(Field value will automatically generate if a value is not entered.)]])","v":""}]
[null,{"$f":"IF(Table1[[#This Row],[Facility Record No.\n(Field value will automatically generate if a value is not entered.)]]=\"\",\"\",Table1[[#This Row],[Facility Record No.\n(Field value will automatically generate if a value is not entered.)]])","v":""}]
[null,{"$f":"IF(Table1[[#This Row],[Facility Record No.\n(Field value will automatically generate if a value is not entered.)]]=\"\",\"\",Table1[[#This Row],[Facility Record No.\n(Field value will automatically generate if a value is not entered.)]])","v":""}]
[null,{"$f":"IF(Table1[[#This Row],[Facility Record No.\n(Field value will automatically generate if a value is not entered.)]]=\"\",\"\",Table1[[#This Row],[Facility Record No.\n(Field value will automatically generate if a value is not entered.)]])","v":""}]
[null,{"$f":"IF(Table1[[#This Row],[Facility Record No.\n(Field value will automatically generate if a value is not entered.)]]=\"\",\"\",Table1[[#This Row],[Facility Record No.\n(Field value will automatically generate if a value is not entered.)]])","v":""}]
[null,{"$f":"IF(Table1[[#This Row],[Facility Record No.\n(Field value will automatically generate if a value is not entered.)]]=\"\",\"\",Table1[[#This Row],[Facility Record No.\n(Field value will automatically generate if a value is not entered.)]])","v":""}]
[null,{"$f":"IF(Table1[[#This Row],[Facility Record No.\n(Field value will automatically generate if a value is not entered.)]]=\"\",\"\",Table1[[#This Row],[Facility Record No.\n(Field value will automatically generate if a value is not entered.)]])","v":""}]
[null,{"$f":"IF(Table1[[#This Row],[Facility Record No.\n(Field value will automatically generate if a value is not entered.)]]=\"\",\"\",Table1[[#This Row],[Facility Record No.\n(Field value will automatically generate if a value is not entered.)]])","v":""}]
[null,{"$f":"IF(Table1[[#This Row],[Facility Record No.\n(Field value will automatically generate if a value is not entered.)]]=\"\",\"\",Table1[[#This Row],[Facility Record No.\n(Field value will automatically generate if a value is not entered.)]])","v":""}]
[null,{"$f":"IF(Table1[[#This Row],[Facility Record No.\n(Field value will automatically generate if a value is not entered.)]]=\"\",\"\",Table1[[#This Row],[Facility Record No.\n(Field value will automatically generate if a value is not entered.)]])","v":""}]
[null,{"$f":"IF(Table1[[#This Row],[Facility Record No.\n(Field value will automatically generate if a value is not entered.)]]=\"\",\"\",Table1[[#This Row],[Facility Record No.\n(Field value will automatically generate if a value is not entered.)]])","v":""}]
[null,{"$f":"IF(Table1[[#This Row],[Facility Record No.\n(Field value will automatically generate if a value is not entered.)]]=\"\",\"\",Table1[[#This Row],[Facility Record No.\n(Field value will automatically generate if a value is not entered.)]])","v":""}]

{"sheet":"CMS_Deviation_Outage","index":3,"n_rows":23,"n_cols":19,"rows_kept":23,"cut":false,"hidden":false,"merged":[]}
[null,"DO NOT REMOVE OR EDIT INFORMATION IN ROWS 1 THROUGH 5\nFOR INTERNAL USE ONLY"]
[null,"Template Name",{"$f":"Welcome!B2","v":"Gasoline Distribution Semiannual Reports (Spreadsheet Template)"}]
[null,"CitationID",{"$f":"Welcome!B3","v":"60.505a(c)"}]
[null,"Template Version",{"$f":"Welcome!B4","v":"draft"}]
[null,"Last Updated Date",{"$f":"Welcome!B5","v":"2023-09-28"}]
[]
[null,{"$f":"Facility_Information!B7","v":"40 CFR Part 60, Subpart XXa, 40 CFR Part 63, Subpart R, 40 CFR Part 63, Subpart BBBBBB - Gasoline Distribution"}]
[null,{"$f":"Facility_Information!B8","v":"§60.505a(c), §63.428(m), and §63.11095(d) Semiannual  Report Spreadsheet Template"}]
[]
[null,"Note: Facility Record No. selections appear once a Facility(s) is added to Facility_Information worksheet. This tab is used to report periods when a CEMS or CPMS is out-of-control or nonoperational or when a deviation from an operating limit or concentration limit has occurred."]
[{"$nulls":12},"Deviation From Limits Only",null,"When the limited alternative for vapor recovery systems in §60.504a(e) is used"]
[null,"Facility Record No.\n(Select from dropdown)","Unique CMS Identifier\n(§60.505a(c)(2)(i)(D), §60.505a(c)(ii)(C), §63.428(m)(2)(i)(D), §63.428(m)(2)(ii)(C), §63.11095(d)(2)(i)(D), §63.11095(d)(2)(ii)(C))","CMS Make\n(§60.505a(c)(2)(i)(E), §60.505a(c)(ii)(D), §63.428(m)(2)(i)(E), §63.428(m)(2)(ii)(D), §63.11095(d)(2)(i)(E), §63.11095(d)(2)(ii)(D))","CMS Model Number\n(§60.505a(c)(2)(i)(E), §60.505a(c)(ii)(D), §63.428(m)(2)(i)(E), §63.428(m)(2)(ii)(D), §63.11095(d)(2)(i)(E), §63.11095(d)(2)(ii)(D))","Date of Last CMS Calibration Check\n(§60.505a(c)(2)(i)(E), §60.505a(c)(ii)(D), §63.428(m)(2)(i)(E), §63.428(m)(2)(ii)(D), §63.11095(d)(2)(i)(E), §63.11095(d)(2)(ii)(D))","Deviation From Limit, Out of Control, or Not Operating? \n(§60.505a(c)(2), §63.428(m)(2), §63.11095(d)(2))","Date of Deviation\n(§60.505a(c)(2)(i)(A), §60.505a(c)(2)(ii)(A), §63.428(m)(2)(i)(A), §63.428(m)(2)(ii)(A), §63.11095(d)(2)(i)(A), §63.11095(d)(2)(ii)(A))","Start Time of Deviation\n(§60.505a(c)(2)(i)(A), §60.505a(c)(2)(ii)(A), §63.428(m)(2)(i)(A), §63.428(m)(2)(ii)(A), §63.11095(d)(2)(i)(A), §63.11095(d)(2)(ii)(A))","Duration of Deviation\n(hours)\n(§60.505a(c)(2)(i)(B), §60.505a(c)(2)(ii)(B), §63.428(m)(2)(i)(B), §63.428(m)(2)(ii)(B), §63.11095(d)(2)(i)(B), §63.11095(d)(2)(ii)(B))","Cause of Deviation\n(§60.505a(c)(2)(i)(F), §60.505a(c)(2)(ii)(E), §63.428(m)(2)(i)(F), §63.428(m)(2)(ii)(E), §63.11095(d)(2)(i)(F), §63.11095(d)(2)(ii)(E))","Corrective Action Taken\n(§60.505a(c)(2)(i)(F), §60.505a(c)(2)(ii)(E), §63.428(m)(2)(i)(F), §63.428(m)(2)(ii)(E), §63.11095(d)(2)(i)(F), §63.11095(d)(2)(ii)(E))","3-Hour Rolling Average Combustion Zone Temperature, 3-Hour Rolling Average TOC Concentration, Average Pressure\n(§60.505a(c)(2)(i)(C), §63.428(m)(2)(i)(C), §63.11095(d)(2)(i)(C))","Unit of Measure for \nColumn M\n(§60.505a(c)(2)(i)(C), §63.428(m)(2)(i)(C), §63.11095(d)(2)(i)(C))","Were there deviations from the operating limits when using the limited alternative?\n(§60.505a(c)(2)(ii)(F), §63.428(m)(2)(ii)(F), §63.11095(d)(2)(ii)(F))","Number of adsorption cycles when the quantity of liquid product loaded in gasoline cargo tanks exceeded the operating limit established in §60.504a(e)(1)\n(§60.505a(c)(2)(ii)(F)(1), §63.428(m)(2)(ii)(F)(1), §63.11095(d)(2)(ii)(F)(1))","Number of desorption cycles when the vacuum pressure was below the average vacuum pressure as specified in §60.504a(e)(2)(i)\n(§60.505a(c)(2)(ii)(F)(2), §63.428(m)(2)(ii)(F)(2), §63.11095(d)(2)(ii)(F)(2))","Number of desorption cycles when the quantity of purge gas used was below the average quantity of purge gas as specified in §60.504a(e)(2)(ii)\n(§60.505a(c)(2)(ii)(F)(3), §63.428(m)(2)(ii)(F)(3), §63.11095(d)(2)(ii)(F)(3))","Number of desorption cycles when the duration of the vacuum/purge cycle was less than the average duration as specified in §60.504a(e)(2)(iii)\n(§60.505a(c)(2)(ii)(F)(4), §63.428(m)(2)(ii)(F)(4), §63.11095(d)(2)(ii)(F)(4))"]
[null,"RecordId","CMSDescription","EquipmentMfr","EquipmentModelNo","CMSAuditDate","CMSDeviationType","ParameterExcessStartDate","ParameterExcessStartTime","ParameterExcessDuration","ExceedanceCause","CorrectiveAction","CMSValue","CMSUnits","CMSAltDevFlag","CMSAltDev1","CMSAltDev2","CMSAltDev3","CMSAltDev4"]
[null,"e.g.:","e.g.:","e.g.:","e.g.:","e.g.:","e.g.:","e.g.:","e.g.:","e.g.:","e.g.:","e.g.:","e.g.:","e.g.:","e.g.:","e.g.:","e.g.:","e.g.:","e.g.:"]
[null,"e.g.: 1","e.g.: Unit 1 Temp A","e.g.: Company X","e.g.: AB-20","e.g.: 01/01/22","e.g.: Deviation from Limit","e.g.: 02/02/22","e.g.: 1:30 PM","e.g. 2","e.g.:","e.g.:","e.g.: 1060","e.g.: ° C","e.g.: yes","e.g.: 1","e.g.: 0","e.g.: 0","e.g.: 0"]
[null,"e.g.:","e.g.:","e.g.:","e.g.:","e.g.:","e.g.:","e.g.:","e.g.:","e.g.:",null,null,"e.g.:","e.g.:","e.g.:","e.g.:","e.g.:","e.g.:","e.g.:"]
[null,"e.g.:","e.g.:","e.g.:","e.g.:","e.g.:","e.g.:","e.g.:","e.g.:","e.g.:",null,null,"e.g.:","e.g.:","e.g.:","e.g.:","e.g.:","e.g.:","e.g.:"]
[null,"e.g.:","e.g.:","e.g.:","e.g.:","e.g.:","e.g.:","e.g.:","e.g.:","e.g.:",null,null,"e.g.:","e.g.:","e.g.:","e.g.:","e.g.:","e.g.:","e.g.:"]
[null,"e.g.:","e.g.:","e.g.:","e.g.:","e.g.:","e.g.:","e.g.:","e.g.:","e.g.:",null,null,"e.g.:","e.g.:","e.g.:","e.g.:","e.g.:","e.g.:","e.g.:"]
[null,"e.g.:","e.g.:","e.g.:","e.g.:","e.g.:","e.g.:","e.g.:","e.g.:","e.g.:",null,null,"e.g.:","e.g.:","e.g.:","e.g.:","e.g.:","e.g.:","e.g.:"]
[null,"e.g.:","e.g.:","e.g.:","e.g.:","e.g.:","e.g.:","e.g.:","e.g.:","e.g.:",null,null,"e.g.:","e.g.:","e.g.:","e.g.:","e.g.:","e.g.:","e.g.:"]
[null,"e.g.:","e.g.:","e.g.:","e.g.:","e.g.:","e.g.:","e.g.:","e.g.:","e.g.:",null,null,"e.g.:","e.g.:","e.g.:","e.g.:","e.g.:","e.g.:","e.g.:"]
[null,"e.g.:","e.g.:","e.g.:","e.g.:","e.g.:","e.g.:","e.g.:","e.g.:","e.g.:",null,null,"e.g.:","e.g.:","e.g.:","e.g.:","e.g.:","e.g.:","e.g.:"]

{"sheet":"Flares","index":4,"n_rows":5023,"n_cols":25,"rows_kept":5023,"cut":false,"hidden":false,"merged":[]}
[null,"DO NOT REMOVE OR EDIT INFORMATION IN ROWS 1 THROUGH 5\nFOR INTERNAL USE ONLY"]
[null,{"$f":"Welcome!A2","v":"Template Name"},{"$f":"Welcome!B2","v":"Gasoline Distribution Semiannual Reports (Spreadsheet Template)"}]
[null,{"$f":"Welcome!A3","v":"CitationID"},{"$f":"Welcome!B3","v":"60.505a(c)"}]
[null,{"$f":"Welcome!A4","v":"Template Version"},{"$f":"Welcome!B4","v":"draft"}]
[null,{"$f":"Welcome!A5","v":"Last Updated Date"},{"$f":"Welcome!B5","v":"2023-09-28"}]
[]
[null,{"$f":"Facility_Information!B7","v":"40 CFR Part 60, Subpart XXa, 40 CFR Part 63, Subpart R, 40 CFR Part 63, Subpart BBBBBB - Gasoline Distribution"}]
[null,{"$f":"Facility_Information!B8","v":"§60.505a(c), §63.428(m), and §63.11095(d) Semiannual  Report Spreadsheet Template"}]
[]
[null,"Note: Facility Record No. selections appear once a Facility(s) is added to Facility_Information worksheet. Columns I-Y will be blacked out depending on the answers provided in Column D."]
[{"$nulls":8},"Visible Emissions Exceeded","Operating Limits Not Met",{"$nulls":9},"Information on CMS Involved (if applicable)"]
[null,"Facility Record No.\n(Select from dropdown)","Flare or Thermal Oxidizer ID\n(§60.505a(c)(3), §63.428(m)(3), §63.11095(d)(3))","Type of Event\n(§60.505a(c)(3), §63.428(m)(3), §63.11095(d)(3))\n(Select from dropdown)","Start Date\n(§60.505a(c)(3), §63.428(m)(3), §63.11095(d)(3))","Start Time\n(§60.505a(c)(3), §63.428(m)(3), §63.11095(d)(3))","End time\n(§60.505a(c)(3)(i), §63.428(m)(3)(i), §63.11095(d)(3)(i))","Duration\n(minutes)\n(§60.505a(c)(3)(ii), §63.428(m)(3)(ii), §63.11095(d)(3)(ii))","Number or Estimate of Number of Minutes for Which Emissions Were Visible\n(§60.505a(c)(3)(i)(B), §63.428(m)(3)(i)(B), §63.11095(d)(3)(i)(B))","Which operating limit was not met?\n(§60.505a(c)(3)(i)(C), §63.428(m)(3)(i)(C), §63.11095(d)(3)(i)(C))\n(Select from dropdown)","Value of Net Heating Value Operating Parameter\n(§60.505a(c)(3)(i)(C)(3), §63.428(m)(3)(i)(C)(3), §63.11095(d)(3)(i)(C)(3))","Units of Measure for Operating Parameter\n(§60.505a(c)(3)(i)(C)(3), §63.428(m)(3)(i)(C)(3), §63.11095(d)(3)(i)(C)(3))\n(Autofilled)","Required Minimum Supplemental Gas Flow Rate\n(§60.505a(c)(3)(i)(C)(2), §63.428(m)(3)(i)(C)(2), §63.11095(d)(3)(i)(C)(2))","Actual Supplemental Gas Flow Rate\n(§60.505a(c)(3)(i)(C)(2), §63.428(m)(3)(i)(C)(2), §63.11095(d)(3)(i)(C)(2))","Units of Measure for Gas Flow Rate\n(§60.505a(c)(3)(i)(C)(2), §63.428(m)(3)(i)(C)(2), §63.11095(d)(3)(i)(C)(2))","Required Minimum Ratio of Gasoline Loaded to Total Product Loaded\n(§60.505a(c)(3)(i)(C)(1), §63.428(m)(3)(i)(C)(1), §63.11095(d)(3)(i)(C)(1))","Actual Ratio of Gasoline Loaded to Total Product Loaded\n(§60.505a(c)(3)(i)(C)(1), §63.428(m)(3)(i)(C)(1), §63.11095(d)(3)(i)(C)(1))","Required Minimum Quantity of Gasoline Loaded\n(gallons)\n(§60.505a(c)(3)(i)(C)(1), §63.428(m)(3)(i)(C)(1), §63.11095(d)(3)(i)(C)(1))","Actual Quantity of Gasoline Loaded\n(gallons)\n(§60.505a(c)(3)(i)(C)(1), §63.428(m)(3)(i)(C)(1), §63.11095(d)(3)(i)(C)(1))","Unique Identifier for CMS\n(§60.505a(c)(3)(iii)(A), §63.428(m)(3)(iii)(A), §63.11095(d)(3)(iii)(A))","CMS Make\n(§60.505a(c)(3)(iii)(B), §63.428(m)(3)(iii)(B), §63.11095(d)(3)(iii)(B))","CMS Model Number\n(§60.505a(c)(3)(iii)(B), §63.428(m)(3)(iii)(B), §63.11095(d)(3)(iii)(B))","Date of Last CMS Calibration Check\n(§60.505a(c)(3)(iii)(B), §63.428(m)(3)(iii)(B), §63.11095(d)(3)(iii)(B))","Cause of Deviation or Downtime\n(§60.505a(c)(3)(iii)(C), §63.428(m)(3)(iii)(C), §63.11095(d)(3)(iii)(C))","Corrective Action Taken\n(§60.505a(c)(3)(iii)(C), §63.428(m)(3)(iii)(C), §63.11095(d)(3)(iii)(C))"]
[null,"RecordId","FlareId","FlareEventType","FlareStartDate","FlareStartTime","FlareEndTime","FlareDuration","VETime","FlareOpLimitExceeded","FlareOpLimitValue","FlareOpLimitUnits","FlareReqMinGas","FlareActualGas","FlareGasUnits","FlareReqMinRatio","FlareActualRatio","FlareReqMinLoaded","FlareActualLoaded","FlareCMSId","FlareCMSMake","FlareCMSModel","FlareCMSAuditDate","FlareCMSDevCause","FlareCMSCorrective"]
[null,"e.g.: 1","e.g.: Flare ABC","e.g.: No pilot flame present","e.g.: 06/01/23","e.g.: 9:20 AM","e.g.: 9:35 AM","e.g.:","e.g.: 20","e.g.: NHVcz","e.g.: 450","e.g.: Btu/scf","e.g.:","e.g.:","e.g.: scfh","e.g.:","e.g.:","e.g.:","e.g.:","e.g.: Unit 1 Temp A","e.g.: Company X","e.g.: AB-20","e.g.: 01/01/22","e.g.:","e.g.:"]
[null,"e.g.","e.g.","e.g.","e.g.","e.g.","e.g.","e.g.","e.g.","e.g.","e.g.","e.g.","e.g.","e.g.","e.g.","e.g.:","e.g.:","e.g.:","e.g.:","e.g.:","e.g.:","e.g.:","e.g.:","e.g.:","e.g.:"]
[null,"e.g.","e.g.","e.g.","e.g.","e.g.","e.g.","e.g.","e.g.","e.g.","e.g.","e.g.","e.g.","e.g.","e.g.","e.g.:","e.g.:","e.g.:","e.g.:","e.g.:","e.g.:","e.g.:","e.g.:","e.g.:","e.g.:"]
[null,"e.g.","e.g.","e.g.","e.g.","e.g.","e.g.","e.g.","e.g.","e.g.","e.g.","e.g.","e.g.","e.g.","e.g.","e.g.:","e.g.:","e.g.:","e.g.:","e.g.:","e.g.:","e.g.:","e.g.:","e.g.:","e.g.:"]
[null,"e.g.","e.g.","e.g.","e.g.","e.g.","e.g.","e.g.","e.g.","e.g.","e.g.","e.g.","e.g.","e.g.","e.g.","e.g.:","e.g.:","e.g.:","e.g.:","e.g.:","e.g.:","e.g.:","e.g.:","e.g.:","e.g.:"]
[null,"e.g.","e.g.","e.g.","e.g.","e.g.","e.g.","e.g.","e.g.","e.g.","e.g.","e.g.","e.g.","e.g.","e.g.","e.g.:","e.g.:","e.g.:","e.g.:","e.g.:","e.g.:","e.g.:","e.g.:","e.g.:","e.g.:"]
[null,"e.g.","e.g.","e.g.","e.g.","e.g.","e.g.","e.g.","e.g.","e.g.","e.g.","e.g.","e.g.","e.g.","e.g.","e.g.:","e.g.:","e.g.:","e.g.:","e.g.:","e.g.:","e.g.:","e.g.:","e.g.:","e.g.:"]
[null,"e.g.","e.g.","e.g.","e.g.","e.g.","e.g.","e.g.","e.g.","e.g.","e.g.","e.g.","e.g.","e.g.","e.g.","e.g.:","e.g.:","e.g.:","e.g.:","e.g.:","e.g.:","e.g.:","e.g.:","e.g.:","e.g.:"]
[null,"e.g.","e.g.","e.g.","e.g.","e.g.","e.g.","e.g.","e.g.","e.g.","e.g.","e.g.","e.g.","e.g.","e.g.","e.g.:","e.g.:","e.g.:","e.g.:","e.g.:","e.g.:","e.g.:","e.g.:","e.g.:","e.g.:"]
[null,"e.g.","e.g.","e.g.","e.g.","e.g.","e.g.","e.g.","e.g.","e.g.","e.g.","e.g.","e.g.","e.g.","e.g.","e.g.:","e.g.:","e.g.:","e.g.:","e.g.:","e.g.:","e.g.:","e.g.:","e.g.:","e.g.:"]
[{"$nulls":11},{"$f":"IF(J24=\"\",\"\",IF(J24=\"NHVcz\",\"Btu/scf\",IF(J24=\"NHVdil\",\"Btu/sq ft\",\"\")))","v":""}]
[{"$nulls":11},{"$f":"IF(J25=\"\",\"\",IF(J25=\"NHVcz\",\"Btu/scf\",IF(J25=\"NHVdil\",\"Btu/sq ft\",\"\")))","v":""}]
[{"$nulls":11},""]
[{"$nulls":11},""]
[{"$nulls":11},""]
[{"$nulls":11},""]
[{"$nulls":11},""]
[{"$nulls":11},""]
[{"$nulls":11},""]
[{"$nulls":11},""]
[{"$nulls":11},""]
[{"$nulls":11},""]
[{"$nulls":11},""]
[{"$nulls":11},""]
[{"$nulls":11},""]
[{"$nulls":11},""]
[{"$nulls":11},""]
[{"$nulls":11},""]
[{"$nulls":11},""]
[{"$nulls":11},""]
[{"$nulls":11},""]
[{"$nulls":11},""]
[{"$nulls":11},""]
[{"$nulls":11},""]
[{"$nulls":11},""]
[{"$nulls":11},""]
[{"$nulls":11},""]
[{"$nulls":11},""]
[{"$nulls":11},""]
[{"$nulls":11},""]
[{"$nulls":11},""]
[{"$nulls":11},""]
[{"$nulls":11},""]
[{"$nulls":11},""]
[{"$nulls":11},""]
[{"$nulls":11},""]
[{"$nulls":11},""]
[{"$nulls":11},""]
[{"$nulls":11},""]
[{"$nulls":11},""]
[{"$nulls":11},""]
[{"$nulls":11},""]
[{"$nulls":11},""]
[{"$nulls":11},""]
[{"$nulls":11},""]
[{"$nulls":11},""]
[{"$nulls":11},""]
[{"$nulls":11},""]
[{"$nulls":11},""]
[{"$nulls":11},""]
[{"$nulls":11},""]
[{"$nulls":11},""]
[{"$nulls":11},""]
[{"$nulls":11},""]
[{"$nulls":11},""]
[{"$nulls":11},""]
[{"$nulls":11},""]
[{"$nulls":11},""]
[{"$nulls":11},""]
[{"$nulls":11},""]
[{"$nulls":11},""]
[{"$nulls":11},""]
[{"$nulls":11},""]
[{"$nulls":11},""]
[{"$nulls":11},""]
[{"$nulls":11},{"$f":"IF(J89=\"\",\"\",IF(J89=\"NHVcz\",\"Btu/scf\",IF(J89=\"NHVdil\",\"Btu/sq ft\",\"\")))","v":""}]
[{"$nulls":11},""]
[{"$nulls":11},""]
[{"$nulls":11},""]
[{"$nulls":11},""]
[{"$nulls":11},""]
[{"$nulls":11},""]
[{"$nulls":11},""]
[{"$nulls":11},""]
[{"$nulls":11},""]
[{"$nulls":11},""]
[{"$nulls":11},""]
[{"$nulls":11},""]
[{"$nulls":11},""]
[{"$nulls":11},""]
[{"$nulls":11},""]
[{"$nulls":11},""]
[{"$nulls":11},""]
[{"$nulls":11},""]
[{"$nulls":11},""]
[{"$nulls":11},""]
[{"$nulls":11},""]
[{"$nulls":11},""]
[{"$nulls":11},""]
[{"$nulls":11},""]
[{"$nulls":11},""]
[{"$nulls":11},""]
[{"$nulls":11},""]
[{"$nulls":11},""]
[{"$nulls":11},""]
[{"$nulls":11},""]
[{"$nulls":11},""]
[{"$nulls":11},""]
[{"$nulls":11},""]
[{"$nulls":11},""]
[{"$nulls":11},""]
[{"$nulls":11},""]
[{"$nulls":11},""]
[{"$nulls":11},""]
[{"$nulls":11},""]
[{"$nulls":11},""]
[{"$nulls":11},""]
[{"$nulls":11},""]
[{"$nulls":11},""]
[{"$nulls":11},""]
[{"$nulls":11},""]
[{"$nulls":11},""]
[{"$nulls":11},""]
[{"$nulls":11},""]
[{"$nulls":11},""]
[{"$nulls":11},""]
[{"$nulls":11},""]
[{"$nulls":11},""]
[{"$nulls":11},""]
[{"$nulls":11},""]
[{"$nulls":11},""]
[{"$nulls":11},""]
[{"$nulls":11},""]
[{"$nulls":11},""]
[{"$nulls":11},""]
[{"$nulls":11},""]
[{"$nulls":11},""]
[{"$nulls":11},""]
[{"$nulls":11},""]
[{"$nulls":11},{"$f":"IF(J153=\"\",\"\",IF(J153=\"NHVcz\",\"Btu/scf\",IF(J153=\"NHVdil\",\"Btu/sq ft\",\"\")))","v":""}]
[{"$nulls":11},""]
[{"$nulls":11},""]
[{"$nulls":11},""]
[{"$nulls":11},""]
[{"$nulls":11},""]
[{"$nulls":11},""]
[{"$nulls":11},""]
[{"$nulls":11},""]
[{"$nulls":11},""]
[{"$nulls":11},""]
[{"$nulls":11},""]
[{"$nulls":11},""]
[{"$nulls":11},""]
[{"$nulls":11},""]
[{"$nulls":11},""]
[{"$nulls":11},""]
[{"$nulls":11},""]
[{"$nulls":11},""]
[{"$nulls":11},""]
[{"$nulls":11},""]
[{"$nulls":11},""]
[{"$nulls":11},""]
[{"$nulls":11},""]
[{"$nulls":11},""]
[{"$nulls":11},""]
[{"$nulls":11},""]
[{"$nulls":11},""]
[{"$nulls":11},""]
[{"$nulls":11},""]
[{"$nulls":11},""]
[{"$nulls":11},""]
[{"$nulls":11},""]
[{"$nulls":11},""]
[{"$nulls":11},""]
[{"$nulls":11},""]
[{"$nulls":11},""]
[{"$nulls":11},""]
[{"$nulls":11},""]
[{"$nulls":11},""]
[{"$nulls":11},""]
[{"$nulls":11},""]
[{"$nulls":11},""]
[{"$nulls":11},""]
[{"$nulls":11},""]
[{"$nulls":11},""]
[{"$nulls":11},""]
[{"$nulls":11},""]
[{"$nulls":11},""]
[{"$nulls":11},""]
[{"$nulls":11},""]
[{"$nulls":11},""]
[{"$nulls":11},""]
[{"$nulls":11},""]
[{"$nulls":11},""]
[{"$nulls":11},""]
[{"$nulls":11},""]
[{"$nulls":11},""]
[{"$nulls":11},""]
[{"$nulls":11},""]
[{"$nulls":11},""]
[{"$nulls":11},""]
[{"$nulls":11},""]
[{"$nulls":11},""]
[{"$nulls":11},{"$f":"IF(J217=\"\",\"\",IF(J217=\"NHVcz\",\"Btu/scf\",IF(J217=\"NHVdil\",\"Btu/sq ft\",\"\")))","v":""}]
[{"$nulls":11},""]
[{"$nulls":11},""]
[{"$nulls":11},""]
[{"$nulls":11},""]
[{"$nulls":11},""]
[{"$nulls":11},""]
[{"$nulls":11},""]
[{"$nulls":11},""]
[{"$nulls":11},""]
[{"$nulls":11},""]
[{"$nulls":11},""]
[{"$nulls":11},""]
[{"$nulls":11},""]
[{"$nulls":11},""]
[{"$nulls":11},""]
[{"$nulls":11},""]
[{"$nulls":11},""]
[{"$nulls":11},""]
[{"$nulls":11},""]
[{"$nulls":11},""]
[{"$nulls":11},""]
[{"$nulls":11},""]
[{"$nulls":11},""]
[{"$nulls":11},""]
[{"$nulls":11},""]
[{"$nulls":11},""]
[{"$nulls":11},""]
[{"$nulls":11},""]
[{"$nulls":11},""]
[{"$nulls":11},""]
[{"$nulls":11},""]
[{"$nulls":11},""]
[{"$nulls":11},""]
[{"$nulls":11},""]
[{"$nulls":11},""]
[{"$nulls":11},""]
[{"$nulls":11},""]
[{"$nulls":11},""]
[{"$nulls":11},""]
[{"$nulls":11},""]
[{"$nulls":11},""]
[{"$nulls":11},""]
[{"$nulls":11},""]
[{"$nulls":11},""]
[{"$nulls":11},""]
[{"$nulls":11},""]
[{"$nulls":11},""]
[{"$nulls":11},""]
[{"$nulls":11},""]
[{"$nulls":11},""]
[{"$nulls":11},""]
[{"$nulls":11},""]
[{"$nulls":11},""]
[{"$nulls":11},""]
[{"$nulls":11},""]
[{"$nulls":11},""]
[{"$nulls":11},""]
[{"$nulls":11},""]
[{"$nulls":11},""]
[{"$nulls":11},""]
[{"$nulls":11},""]
[{"$nulls":11},""]
[{"$nulls":11},""]
[{"$nulls":11},{"$f":"IF(J281=\"\",\"\",IF(J281=\"NHVcz\",\"Btu/scf\",IF(J281=\"NHVdil\",\"Btu/sq ft\",\"\")))","v":""}]
[{"$nulls":11},""]
[{"$nulls":11},""]
[{"$nulls":11},""]
[{"$nulls":11},""]
[{"$nulls":11},""]
[{"$nulls":11},""]
[{"$nulls":11},""]
[{"$nulls":11},""]
[{"$nulls":11},""]
[{"$nulls":11},""]
[{"$nulls":11},""]
[{"$nulls":11},""]
[{"$nulls":11},""]
[{"$nulls":11},""]
[{"$nulls":11},""]
[{"$nulls":11},""]
[{"$nulls":11},""]
[{"$nulls":11},""]
[{"$nulls":11},""]
[{"$nulls":11},""]
[{"$nulls":11},""]
[{"$nulls":11},""]
[{"$nulls":11},""]
[{"$nulls":11},""]
[{"$nulls":11},""]
[{"$nulls":11},""]
[{"$nulls":11},""]
[{"$nulls":11},""]
[{"$nulls":11},""]
[{"$nulls":11},""]
[{"$nulls":11},""]
[{"$nulls":11},""]
[{"$nulls":11},""]
[{"$nulls":11},""]
[{"$nulls":11},""]
[{"$nulls":11},""]
[{"$nulls":11},""]
[{"$nulls":11},""]
[{"$nulls":11},""]
[{"$nulls":11},""]
[{"$nulls":11},""]
[{"$nulls":11},""]
[{"$nulls":11},""]
[{"$nulls":11},""]
[{"$nulls":11},""]
[{"$nulls":11},""]
[{"$nulls":11},""]
[{"$nulls":11},""]
[{"$nulls":11},""]
[{"$nulls":11},""]
[{"$nulls":11},""]
[{"$nulls":11},""]
[{"$nulls":11},""]
[{"$nulls":11},""]
[{"$nulls":11},""]
[{"$nulls":11},""]
[{"$nulls":11},""]
[{"$nulls":11},""]
[{"$nulls":11},""]
[{"$nulls":11},""]
[{"$nulls":11},""]
[{"$nulls":11},""]
[{"$nulls":11},""]
[{"$nulls":11},{"$f":"IF(J345=\"\",\"\",IF(J345=\"NHVcz\",\"Btu/scf\",IF(J345=\"NHVdil\",\"Btu/sq ft\",\"\")))","v":""}]
[{"$nulls":11},""]
[{"$nulls":11},""]
[{"$nulls":11},""]
[{"$nulls":11},""]
[{"$nulls":11},""]
[{"$nulls":11},""]
[{"$nulls":11},""]
[{"$nulls":11},""]
[{"$nulls":11},""]
[{"$nulls":11},""]
[{"$nulls":11},""]
[{"$nulls":11},""]
[{"$nulls":11},""]
[{"$nulls":11},""]
[{"$nulls":11},""]
[{"$nulls":11},""]
[{"$nulls":11},""]
[{"$nulls":11},""]
[{"$nulls":11},""]
[{"$nulls":11},""]
[{"$nulls":11},""]
[{"$nulls":11},""]
[{"$nulls":11},""]
[{"$nulls":11},""]
[{"$nulls":11},""]
[{"$nulls":11},""]
[{"$nulls":11},""]
[{"$nulls":11},""]
[{"$nulls":11},""]
[{"$nulls":11},""]
[{"$nulls":11},""]
[{"$nulls":11},""]
[{"$nulls":11},""]
[{"$nulls":11},""]
[{"$nulls":11},""]
[{"$nulls":11},""]
[{"$nulls":11},""]
[{"$nulls":11},""]
[{"$nulls":11},""]
[{"$nulls":11},""]
[{"$nulls":11},""]
[{"$nulls":11},""]
[{"$nulls":11},""]
[{"$nulls":11},""]
[{"$nulls":11},""]
[{"$nulls":11},""]
[{"$nulls":11},""]
[{"$nulls":11},""]
[{"$nulls":11},""]
[{"$nulls":11},""]
[{"$nulls":11},""]
[{"$nulls":11},""]
[{"$nulls":11},""]
[{"$nulls":11},""]
[{"$nulls":11},""]
[{"$nulls":11},""]
[{"$nulls":11},""]
[{"$nulls":11},""]
[{"$nulls":11},""]
[{"$nulls":11},""]
[{"$nulls":11},""]
[{"$nulls":11},""]
[{"$nulls":11},""]
[{"$nulls":11},{"$f":"IF(J409=\"\",\"\",IF(J409=\"NHVcz\",\"Btu/scf\",IF(J409=\"NHVdil\",\"Btu/sq ft\",\"\")))","v":""}]
[{"$nulls":11},""]
[{"$nulls":11},""]
[{"$nulls":11},""]
[{"$nulls":11},""]
[{"$nulls":11},""]
[{"$nulls":11},""]
[{"$nulls":11},""]
[{"$nulls":11},""]
[{"$nulls":11},""]
[{"$nulls":11},""]
[{"$nulls":11},""]
[{"$nulls":11},""]
[{"$nulls":11},""]
[{"$nulls":11},""]
[{"$nulls":11},""]
[{"$nulls":11},""]
[{"$nulls":11},""]
[{"$nulls":11},""]
[{"$nulls":11},""]
[{"$nulls":11},""]
[{"$nulls":11},""]
[{"$nulls":11},""]
[{"$nulls":11},""]
[{"$nulls":11},""]
[{"$nulls":11},""]
[{"$nulls":11},""]
[{"$nulls":11},""]
[{"$nulls":11},""]
[{"$nulls":11},""]
[{"$nulls":11},""]
[{"$nulls":11},""]
[{"$nulls":11},""]
[{"$nulls":11},""]
[{"$nulls":11},""]
[{"$nulls":11},""]
[{"$nulls":11},""]
[{"$nulls":11},""]
[{"$nulls":11},""]
[{"$nulls":11},""]
[{"$nulls":11},""]
[{"$nulls":11},""]
[{"$nulls":11},""]
[{"$nulls":11},""]
[{"$nulls":11},""]
[{"$nulls":11},""]
[{"$nulls":11},""]
[{"$nulls":11},""]
[{"$nulls":11},""]
[{"$nulls":11},""]
[{"$nulls":11},""]
[{"$nulls":11},""]
[{"$nulls":11},""]
[{"$nulls":11},""]
[{"$nulls":11},""]
[{"$nulls":11},""]
[{"$nulls":11},""]
[{"$nulls":11},""]
[{"$nulls":11},""]
[{"$nulls":11},""]
[{"$nulls":11},""]
[{"$nulls":11},""]
[{"$nulls":11},""]
[{"$nulls":11},""]
[{"$nulls":11},{"$f":"IF(J473=\"\",\"\",IF(J473=\"NHVcz\",\"Btu/scf\",IF(J473=\"NHVdil\",\"Btu/sq ft\",\"\")))","v":""}]
[{"$nulls":11},""]
[{"$nulls":11},""]
[{"$nulls":11},""]
[{"$nulls":11},""]
[{"$nulls":11},""]
[{"$nulls":11},""]
[{"$nulls":11},""]
[{"$nulls":11},""]
[{"$nulls":11},""]
[{"$nulls":11},""]
[{"$nulls":11},""]
[{"$nulls":11},""]
[{"$nulls":11},""]
[{"$nulls":11},""]
[{"$nulls":11},""]
[{"$nulls":11},""]
[{"$nulls":11},""]
[{"$nulls":11},""]
[{"$nulls":11},""]
[{"$nulls":11},""]
[{"$nulls":11},""]
[{"$nulls":11},""]
[{"$nulls":11},""]
[{"$nulls":11},""]
[{"$nulls":11},""]
[{"$nulls":11},""]
[{"$nulls":11},""]
[{"$nulls":11},""]
[{"$nulls":11},""]
[{"$nulls":11},""]
[{"$nulls":11},""]
[{"$nulls":11},""]
[{"$nulls":11},""]
[{"$nulls":11},""]
[{"$nulls":11},""]
[{"$nulls":11},""]
[{"$nulls":11},""]
[{"$nulls":11},""]
[{"$nulls":11},""]
[{"$nulls":11},""]
[{"$nulls":11},""]
[{"$nulls":11},""]
[{"$nulls":11},""]
[{"$nulls":11},""]
[{"$nulls":11},""]
[{"$nulls":11},""]
[{"$nulls":11},""]
[{"$nulls":11},""]
[{"$nulls":11},""]
[{"$nulls":11},""]
[{"$nulls":11},""]
[{"$nulls":11},""]
[{"$nulls":11},""]
[{"$nulls":11},""]
[{"$nulls":11},""]
[{"$nulls":11},""]
[{"$nulls":11},""]
[{"$nulls":11},""]
[{"$nulls":11},""]
[{"$nulls":11},""]
[{"$nulls":11},""]
[{"$nulls":11},""]
[{"$nulls":11},""]
[{"$nulls":11},{"$f":"IF(J537=\"\",\"\",IF(J537=\"NHVcz\",\"Btu/scf\",IF(J537=\"NHVdil\",\"Btu/sq ft\",\"\")))","v":""}]
[{"$nulls":11},""]
[{"$nulls":11},""]
[{"$nulls":11},""]
[{"$nulls":11},""]
[{"$nulls":11},""]
[{"$nulls":11},""]
[{"$nulls":11},""]
[{"$nulls":11},""]
[{"$nulls":11},""]
[{"$nulls":11},""]
[{"$nulls":11},""]
[{"$nulls":11},""]
[{"$nulls":11},""]
[{"$nulls":11},""]
[{"$nulls":11},""]
[{"$nulls":11},""]
[{"$nulls":11},""]
[{"$nulls":11},""]
[{"$nulls":11},""]
[{"$nulls":11},""]
[{"$nulls":11},""]
[{"$nulls":11},""]
[{"$nulls":11},""]
[{"$nulls":11},""]
[{"$nulls":11},""]
[{"$nulls":11},""]
[{"$nulls":11},""]
[{"$nulls":11},""]
[{"$nulls":11},""]
[{"$nulls":11},""]
[{"$nulls":11},""]
[{"$nulls":11},""]
[{"$nulls":11},""]
[{"$nulls":11},""]
[{"$nulls":11},""]
[{"$nulls":11},""]
[{"$nulls":11},""]
[{"$nulls":11},""]
[{"$nulls":11},""]
[{"$nulls":11},""]
[{"$nulls":11},""]
[{"$nulls":11},""]
[{"$nulls":11},""]
[{"$nulls":11},""]
[{"$nulls":11},""]
[{"$nulls":11},""]
[{"$nulls":11},""]
[{"$nulls":11},""]
[{"$nulls":11},""]
[{"$nulls":11},""]
[{"$nulls":11},""]
[{"$nulls":11},""]
[{"$nulls":11},""]
[{"$nulls":11},""]
[{"$nulls":11},""]
[{"$nulls":11},""]
[{"$nulls":11},""]
[{"$nulls":11},""]
[{"$nulls":11},""]
[{"$nulls":11},""]
[{"$nulls":11},""]
[{"$nulls":11},""]
[{"$nulls":11},""]
[{"$nulls":11},{"$f":"IF(J601=\"\",\"\",IF(J601=\"NHVcz\",\"Btu/scf\",IF(J601=\"NHVdil\",\"Btu/sq ft\",\"\")))","v":""}]
[{"$nulls":11},""]
[{"$nulls":11},""]
[{"$nulls":11},""]
[{"$nulls":11},""]
[{"$nulls":11},""]
[{"$nulls":11},""]
[{"$nulls":11},""]
[{"$nulls":11},""]
[{"$nulls":11},""]
[{"$nulls":11},""]
[{"$nulls":11},""]
[{"$nulls":11},""]
[{"$nulls":11},""]
[{"$nulls":11},""]
[{"$nulls":11},""]
[{"$nulls":11},""]
[{"$nulls":11},""]
[{"$nulls":11},""]
[{"$nulls":11},""]
[{"$nulls":11},""]
[{"$nulls":11},""]
[{"$nulls":11},""]
[{"$nulls":11},""]
[{"$nulls":11},""]
[{"$nulls":11},""]
[{"$nulls":11},""]
[{"$nulls":11},""]
[{"$nulls":11},""]
[{"$nulls":11},""]
[{"$nulls":11},""]
[{"$nulls":11},""]
[{"$nulls":11},""]
[{"$nulls":11},""]
[{"$nulls":11},""]
[{"$nulls":11},""]
[{"$nulls":11},""]
[{"$nulls":11},""]
[{"$nulls":11},""]
[{"$nulls":11},""]
[{"$nulls":11},""]
[{"$nulls":11},""]
[{"$nulls":11},""]
[{"$nulls":11},""]
[{"$nulls":11},""]
[{"$nulls":11},""]
[{"$nulls":11},""]
[{"$nulls":11},""]
[{"$nulls":11},""]
[{"$nulls":11},""]
[{"$nulls":11},""]
[{"$nulls":11},""]
[{"$nulls":11},""]
[{"$nulls":11},""]
[{"$nulls":11},""]
[{"$nulls":11},""]
[{"$nulls":11},""]
[{"$nulls":11},""]
[{"$nulls":11},""]
[{"$nulls":11},""]
[{"$nulls":11},""]
[{"$nulls":11},""]
[{"$nulls":11},""]
[{"$nulls":11},""]
[{"$nulls":11},{"$f":"IF(J665=\"\",\"\",IF(J665=\"NHVcz\",\"Btu/scf\",IF(J665=\"NHVdil\",\"Btu/sq ft\",\"\")))","v":""}]
[{"$nulls":11},""]
[{"$nulls":11},""]
[{"$nulls":11},""]
[{"$nulls":11},""]
[{"$nulls":11},""]
[{"$nulls":11},""]
[{"$nulls":11},""]
[{"$nulls":11},""]
[{"$nulls":11},""]
[{"$nulls":11},""]
[{"$nulls":11},""]
[{"$nulls":11},""]
[{"$nulls":11},""]
[{"$nulls":11},""]
[{"$nulls":11},""]
[{"$nulls":11},""]
[{"$nulls":11},""]
[{"$nulls":11},""]
[{"$nulls":11},""]
[{"$nulls":11},""]
[{"$nulls":11},""]
[{"$nulls":11},""]
[{"$nulls":11},""]
[{"$nulls":11},""]
[{"$nulls":11},""]
[{"$nulls":11},""]
[{"$nulls":11},""]
[{"$nulls":11},""]
[{"$nulls":11},""]
[{"$nulls":11},""]
[{"$nulls":11},""]
[{"$nulls":11},""]
[{"$nulls":11},""]
[{"$nulls":11},""]
[{"$nulls":11},""]
[{"$nulls":11},""]
[{"$nulls":11},""]
[{"$nulls":11},""]
[{"$nulls":11},""]
[{"$nulls":11},""]
[{"$nulls":11},""]
[{"$nulls":11},""]
[{"$nulls":11},""]
[{"$nulls":11},""]
[{"$nulls":11},""]
[{"$nulls":11},""]
[{"$nulls":11},""]
[{"$nulls":11},""]
[{"$nulls":11},""]
[{"$nulls":11},""]
[{"$nulls":11},""]
[{"$nulls":11},""]
[{"$nulls":11},""]
[{"$nulls":11},""]
[{"$nulls":11},""]
[{"$nulls":11},""]
[{"$nulls":11},""]
[{"$nulls":11},""]
[{"$nulls":11},""]
[{"$nulls":11},""]
[{"$nulls":11},""]
[{"$nulls":11},""]
[{"$nulls":11},""]
[{"$nulls":11},{"$f":"IF(J729=\"\",\"\",IF(J729=\"NHVcz\",\"Btu/scf\",IF(J729=\"NHVdil\",\"Btu/sq ft\",\"\")))","v":""}]
[{"$nulls":11},""]
[{"$nulls":11},""]
[{"$nulls":11},""]
[{"$nulls":11},""]
[{"$nulls":11},""]
[{"$nulls":11},""]
[{"$nulls":11},""]
[{"$nulls":11},""]
[{"$nulls":11},""]
[{"$nulls":11},""]
[{"$nulls":11},""]
[{"$nulls":11},""]
[{"$nulls":11},""]
[{"$nulls":11},""]
[{"$nulls":11},""]
[{"$nulls":11},""]
[{"$nulls":11},""]
[{"$nulls":11},""]
[{"$nulls":11},""]
[{"$nulls":11},""]
[{"$nulls":11},""]
[{"$nulls":11},""]
[{"$nulls":11},""]
[{"$nulls":11},""]
[{"$nulls":11},""]
[{"$nulls":11},""]
[{"$nulls":11},""]
[{"$nulls":11},""]
[{"$nulls":11},""]
[{"$nulls":11},""]
[{"$nulls":11},""]
[{"$nulls":11},""]
[{"$nulls":11},""]
[{"$nulls":11},""]
[{"$nulls":11},""]
[{"$nulls":11},""]
[{"$nulls":11},""]
[{"$nulls":11},""]
[{"$nulls":11},""]
[{"$nulls":11},""]
[{"$nulls":11},""]
[{"$nulls":11},""]
[{"$nulls":11},""]
[{"$nulls":11},""]
[{"$nulls":11},""]
[{"$nulls":11},""]
[{"$nulls":11},""]
[{"$nulls":11},""]
[{"$nulls":11},""]
[{"$nulls":11},""]
[{"$nulls":11},""]
[{"$nulls":11},""]
[{"$nulls":11},""]
[{"$nulls":11},""]
[{"$nulls":11},""]
[{"$nulls":11},""]
[{"$nulls":11},""]
[{"$nulls":11},""]
[{"$nulls":11},""]
[{"$nulls":11},""]
[{"$nulls":11},""]
[{"$nulls":11},""]
[{"$nulls":11},""]
[{"$nulls":11},{"$f":"IF(J793=\"\",\"\",IF(J793=\"NHVcz\",\"Btu/scf\",IF(J793=\"NHVdil\",\"Btu/sq ft\",\"\")))","v":""}]
[{"$nulls":11},""]
[{"$nulls":11},""]
[{"$nulls":11},""]
[{"$nulls":11},""]
[{"$nulls":11},""]
[{"$nulls":11},""]
[{"$nulls":11},""]
[{"$nulls":11},""]
[{"$nulls":11},""]
[{"$nulls":11},""]
[{"$nulls":11},""]
[{"$nulls":11},""]
[{"$nulls":11},""]
[{"$nulls":11},""]
[{"$nulls":11},""]
[{"$nulls":11},""]
[{"$nulls":11},""]
[{"$nulls":11},""]
[{"$nulls":11},""]
[{"$nulls":11},""]
[{"$nulls":11},""]
[{"$nulls":11},""]
[{"$nulls":11},""]
[{"$nulls":11},""]
[{"$nulls":11},""]
[{"$nulls":11},""]
[{"$nulls":11},""]
[{"$nulls":11},""]
[{"$nulls":11},""]
[{"$nulls":11},""]
[{"$nulls":11},""]
[{"$nulls":11},""]
[{"$nulls":11},""]
[{"$nulls":11},""]
[{"$nulls":11},""]
[{"$nulls":11},""]
[{"$nulls":11},""]
[{"$nulls":11},""]
[{"$nulls":11},""]
[{"$nulls":11},""]
[{"$nulls":11},""]
[{"$nulls":11},""]
[{"$nulls":11},""]
[{"$nulls":11},""]
[{"$nulls":11},""]
[{"$nulls":11},""]
[{"$nulls":11},""]
[{"$nulls":11},""]
[{"$nulls":11},""]
[{"$nulls":11},""]
[{"$nulls":11},""]
[{"$nulls":11},""]
[{"$nulls":11},""]
[{"$nulls":11},""]
[{"$nulls":11},""]
[{"$nulls":11},""]
[{"$nulls":11},""]
[{"$nulls":11},""]
[{"$nulls":11},""]
[{"$nulls":11},""]
[{"$nulls":11},""]
[{"$nulls":11},""]
[{"$nulls":11},""]
[{"$nulls":11},{"$f":"IF(J857=\"\",\"\",IF(J857=\"NHVcz\",\"Btu/scf\",IF(J857=\"NHVdil\",\"Btu/sq ft\",\"\")))","v":""}]
[{"$nulls":11},""]
[{"$nulls":11},""]
[{"$nulls":11},""]
[{"$nulls":11},""]
[{"$nulls":11},""]
[{"$nulls":11},""]
[{"$nulls":11},""]
[{"$nulls":11},""]
[{"$nulls":11},""]
[{"$nulls":11},""]
[{"$nulls":11},""]
[{"$nulls":11},""]
[{"$nulls":11},""]
[{"$nulls":11},""]
[{"$nulls":11},""]
[{"$nulls":11},""]
[{"$nulls":11},""]
[{"$nulls":11},""]
[{"$nulls":11},""]
[{"$nulls":11},""]
[{"$nulls":11},""]
[{"$nulls":11},""]
[{"$nulls":11},""]
[{"$nulls":11},""]
[{"$nulls":11},""]
[{"$nulls":11},""]
[{"$nulls":11},""]
[{"$nulls":11},""]
[{"$nulls":11},""]
[{"$nulls":11},""]
[{"$nulls":11},""]
[{"$nulls":11},""]
[{"$nulls":11},""]
[{"$nulls":11},""]
[{"$nulls":11},""]
[{"$nulls":11},""]
[{"$nulls":11},""]
[{"$nulls":11},""]
[{"$nulls":11},""]
[{"$nulls":11},""]
[{"$nulls":11},""]
[{"$nulls":11},""]
[{"$nulls":11},""]
[{"$nulls":11},""]
[{"$nulls":11},""]
[{"$nulls":11},""]
[{"$nulls":11},""]
[{"$nulls":11},""]
[{"$nulls":11},""]
[{"$nulls":11},""]
[{"$nulls":11},""]
[{"$nulls":11},""]
[{"$nulls":11},""]
[{"$nulls":11},""]
[{"$nulls":11},""]
[{"$nulls":11},""]
[{"$nulls":11},""]
[{"$nulls":11},""]
[{"$nulls":11},""]
[{"$nulls":11},""]
[{"$nulls":11},""]
[{"$nulls":11},""]
[{"$nulls":11},""]
[{"$nulls":11},{"$f":"IF(J921=\"\",\"\",IF(J921=\"NHVcz\",\"Btu/scf\",IF(J921=\"NHVdil\",\"Btu/sq ft\",\"\")))","v":""}]
[{"$nulls":11},""]
[{"$nulls":11},""]
[{"$nulls":11},""]
[{"$nulls":11},""]
[{"$nulls":11},""]
[{"$nulls":11},""]
[{"$nulls":11},""]
[{"$nulls":11},""]
[{"$nulls":11},""]
[{"$nulls":11},""]
[{"$nulls":11},""]
[{"$nulls":11},""]
[{"$nulls":11},""]
[{"$nulls":11},""]
[{"$nulls":11},""]
[{"$nulls":11},""]
[{"$nulls":11},""]
[{"$nulls":11},""]
[{"$nulls":11},""]
[{"$nulls":11},""]
[{"$nulls":11},""]
[{"$nulls":11},""]
[{"$nulls":11},""]
[{"$nulls":11},""]
[{"$nulls":11},""]
[{"$nulls":11},""]
[{"$nulls":11},""]
[{"$nulls":11},""]
[{"$nulls":11},""]
[{"$nulls":11},""]
[{"$nulls":11},""]
[{"$nulls":11},""]
[{"$nulls":11},""]
[{"$nulls":11},""]
[{"$nulls":11},""]
[{"$nulls":11},""]
[{"$nulls":11},""]
[{"$nulls":11},""]
[{"$nulls":11},""]
[{"$nulls":11},""]
[{"$nulls":11},""]
[{"$nulls":11},""]
[{"$nulls":11},""]
[{"$nulls":11},""]
[{"$nulls":11},""]
[{"$nulls":11},""]
[{"$nulls":11},""]
[{"$nulls":11},""]
[{"$nulls":11},""]
[{"$nulls":11},""]
[{"$nulls":11},""]
[{"$nulls":11},""]
[{"$nulls":11},""]
[{"$nulls":11},""]
[{"$nulls":11},""]
[{"$nulls":11},""]
[{"$nulls":11},""]
[{"$nulls":11},""]
[{"$nulls":11},""]
[{"$nulls":11},""]
[{"$nulls":11},""]
[{"$nulls":11},""]
[{"$nulls":11},""]
[{"$nulls":11},{"$f":"IF(J985=\"\",\"\",IF(J985=\"NHVcz\",\"Btu/scf\",IF(J985=\"NHVdil\",\"Btu/sq ft\",\"\")))","v":""}]
[{"$nulls":11},""]
[{"$nulls":11},""]
[{"$nulls":11},""]
[{"$nulls":11},""]
[{"$nulls":11},""]
[{"$nulls":11},""]
[{"$nulls":11},""]
[{"$nulls":11},""]
[{"$nulls":11},""]
[{"$nulls":11},""]
[{"$nulls":11},""]
[{"$nulls":11},""]
[{"$nulls":11},""]
[{"$nulls":11},""]
[{"$nulls":11},""]
[{"$nulls":11},""]
[{"$nulls":11},""]
[{"$nulls":11},""]
[{"$nulls":11},""]
[{"$nulls":11},""]
[{"$nulls":11},""]
[{"$nulls":11},""]
[{"$nulls":11},""]
[{"$nulls":11},""]
[{"$nulls":11},""]
[{"$nulls":11},""]
[{"$nulls":11},""]
[{"$nulls":11},""]
[{"$nulls":11},""]
[{"$nulls":11},""]
[{"$nulls":11},""]
[{"$nulls":11},""]
[{"$nulls":11},""]
[{"$nulls":11},""]
[{"$nulls":11},""]
[{"$nulls":11},""]
[{"$nulls":11},""]
[{"$nulls":11},""]
[{"$nulls":11},""]
[{"$nulls":11},""]
[{"$nulls":11},""]
[{"$nulls":11},""]
[{"$nulls":11},""]
[{"$nulls":11},""]
[{"$nulls":11},""]
[{"$nulls":11},""]
[{"$nulls":11},""]
[{"$nulls":11},""]
[{"$nulls":11},""]
[{"$nulls":11},""]
[{"$nulls":11},""]
[{"$nulls":11},""]
[{"$nulls":11},""]
[{"$nulls":11},""]
[{"$nulls":11},""]
[{"$nulls":11},""]
[{"$nulls":11},""]
[{"$nulls":11},""]
[{"$nulls":11},""]
[{"$nulls":11},""]
[{"$nulls":11},""]
[{"$nulls":11},""]
[{"$nulls":11},""]
[{"$nulls":11},{"$f":"IF(J1049=\"\",\"\",IF(J1049=\"NHVcz\",\"Btu/scf\",IF(J1049=\"NHVdil\",\"Btu/sq ft\",\"\")))","v":""}]
[{"$nulls":11},""]
[{"$nulls":11},""]
[{"$nulls":11},""]
[{"$nulls":11},""]
[{"$nulls":11},""]
[{"$nulls":11},""]
[{"$nulls":11},""]
[{"$nulls":11},""]
[{"$nulls":11},""]
[{"$nulls":11},""]
[{"$nulls":11},""]
[{"$nulls":11},""]
[{"$nulls":11},""]
[{"$nulls":11},""]
[{"$nulls":11},""]
[{"$nulls":11},""]
[{"$nulls":11},""]
[{"$nulls":11},""]
[{"$nulls":11},""]
[{"$nulls":11},""]
[{"$nulls":11},""]
[{"$nulls":11},""]
[{"$nulls":11},""]
[{"$nulls":11},""]
[{"$nulls":11},""]
[{"$nulls":11},""]
[{"$nulls":11},""]
[{"$nulls":11},""]
[{"$nulls":11},""]
[{"$nulls":11},""]
[{"$nulls":11},""]
[{"$nulls":11},""]
[{"$nulls":11},""]
[{"$nulls":11},""]
[{"$nulls":11},""]
[{"$nulls":11},""]
[{"$nulls":11},""]
[{"$nulls":11},""]
[{"$nulls":11},""]
[{"$nulls":11},""]
[{"$nulls":11},""]
[{"$nulls":11},""]
[{"$nulls":11},""]
[{"$nulls":11},""]
[{"$nulls":11},""]
[{"$nulls":11},""]
[{"$nulls":11},""]
[{"$nulls":11},""]
[{"$nulls":11},""]
[{"$nulls":11},""]
[{"$nulls":11},""]
[{"$nulls":11},""]
[{"$nulls":11},""]
[{"$nulls":11},""]
[{"$nulls":11},""]
[{"$nulls":11},""]
[{"$nulls":11},""]
[{"$nulls":11},""]
[{"$nulls":11},""]
[{"$nulls":11},""]
[{"$nulls":11},""]
[{"$nulls":11},""]
[{"$nulls":11},""]
[{"$nulls":11},{"$f":"IF(J1113=\"\",\"\",IF(J1113=\"NHVcz\",\"Btu/scf\",IF(J1113=\"NHVdil\",\"Btu/sq ft\",\"\")))","v":""}]
[{"$nulls":11},""]
[{"$nulls":11},""]
[{"$nulls":11},""]
[{"$nulls":11},""]
[{"$nulls":11},""]
[{"$nulls":11},""]
[{"$nulls":11},""]
[{"$nulls":11},""]
[{"$nulls":11},""]
[{"$nulls":11},""]
[{"$nulls":11},""]
[{"$nulls":11},""]
[{"$nulls":11},""]
[{"$nulls":11},""]
[{"$nulls":11},""]
[{"$nulls":11},""]
[{"$nulls":11},""]
[{"$nulls":11},""]
[{"$nulls":11},""]
[{"$nulls":11},""]
[{"$nulls":11},""]
[{"$nulls":11},""]
[{"$nulls":11},""]
[{"$nulls":11},""]
[{"$nulls":11},""]
[{"$nulls":11},""]
[{"$nulls":11},""]
[{"$nulls":11},""]
[{"$nulls":11},""]
[{"$nulls":11},""]
[{"$nulls":11},""]
[{"$nulls":11},""]
[{"$nulls":11},""]
[{"$nulls":11},""]
[{"$nulls":11},""]
[{"$nulls":11},""]
[{"$nulls":11},""]
[{"$nulls":11},""]
[{"$nulls":11},""]
[{"$nulls":11},""]
[{"$nulls":11},""]
[{"$nulls":11},""]
[{"$nulls":11},""]
[{"$nulls":11},""]
[{"$nulls":11},""]
[{"$nulls":11},""]
[{"$nulls":11},""]
[{"$nulls":11},""]
[{"$nulls":11},""]
[{"$nulls":11},""]
[{"$nulls":11},""]
[{"$nulls":11},""]
[{"$nulls":11},""]
[{"$nulls":11},""]
[{"$nulls":11},""]
[{"$nulls":11},""]
[{"$nulls":11},""]
[{"$nulls":11},""]
[{"$nulls":11},""]
[{"$nulls":11},""]
[{"$nulls":11},""]
[{"$nulls":11},""]
[{"$nulls":11},""]
[{"$nulls":11},{"$f":"IF(J1177=\"\",\"\",IF(J1177=\"NHVcz\",\"Btu/scf\",IF(J1177=\"NHVdil\",\"Btu/sq ft\",\"\")))","v":""}]
[{"$nulls":11},""]
[{"$nulls":11},""]
[{"$nulls":11},""]
[{"$nulls":11},""]
[{"$nulls":11},""]
[{"$nulls":11},""]
[{"$nulls":11},""]
[{"$nulls":11},""]
[{"$nulls":11},""]
[{"$nulls":11},""]
[{"$nulls":11},""]
[{"$nulls":11},""]
[{"$nulls":11},""]
[{"$nulls":11},""]
[{"$nulls":11},""]
[{"$nulls":11},""]
[{"$nulls":11},""]
[{"$nulls":11},""]
[{"$nulls":11},""]
[{"$nulls":11},""]
[{"$nulls":11},""]
[{"$nulls":11},""]
[{"$nulls":11},""]
[{"$nulls":11},""]
[{"$nulls":11},""]
[{"$nulls":11},""]
[{"$nulls":11},""]
[{"$nulls":11},""]
[{"$nulls":11},""]
[{"$nulls":11},""]
[{"$nulls":11},""]
[{"$nulls":11},""]
[{"$nulls":11},""]
[{"$nulls":11},""]
[{"$nulls":11},""]
[{"$nulls":11},""]
[{"$nulls":11},""]
[{"$nulls":11},""]
[{"$nulls":11},""]
[{"$nulls":11},""]
[{"$nulls":11},""]
[{"$nulls":11},""]
[{"$nulls":11},""]
[{"$nulls":11},""]
[{"$nulls":11},""]
[{"$nulls":11},""]
[{"$nulls":11},""]
[{"$nulls":11},""]
[{"$nulls":11},""]
[{"$nulls":11},""]
[{"$nulls":11},""]
[{"$nulls":11},""]
[{"$nulls":11},""]
[{"$nulls":11},""]
[{"$nulls":11},""]
[{"$nulls":11},""]
[{"$nulls":11},""]
[{"$nulls":11},""]
[{"$nulls":11},""]
[{"$nulls":11},""]
[{"$nulls":11},""]
[{"$nulls":11},""]
[{"$nulls":11},""]
[{"$nulls":11},{"$f":"IF(J1241=\"\",\"\",IF(J1241=\"NHVcz\",\"Btu/scf\",IF(J1241=\"NHVdil\",\"Btu/sq ft\",\"\")))","v":""}]
[{"$nulls":11},""]
[{"$nulls":11},""]
[{"$nulls":11},""]
[{"$nulls":11},""]
[{"$nulls":11},""]
[{"$nulls":11},""]
[{"$nulls":11},""]
[{"$nulls":11},""]
[{"$nulls":11},""]
[{"$nulls":11},""]
[{"$nulls":11},""]
[{"$nulls":11},""]
[{"$nulls":11},""]
[{"$nulls":11},""]
[{"$nulls":11},""]
[{"$nulls":11},""]
[{"$nulls":11},""]
[{"$nulls":11},""]
[{"$nulls":11},""]
[{"$nulls":11},""]
[{"$nulls":11},""]
[{"$nulls":11},""]
[{"$nulls":11},""]
[{"$nulls":11},""]
[{"$nulls":11},""]
[{"$nulls":11},""]
[{"$nulls":11},""]
[{"$nulls":11},""]
[{"$nulls":11},""]
[{"$nulls":11},""]
[{"$nulls":11},""]
[{"$nulls":11},""]
[{"$nulls":11},""]
[{"$nulls":11},""]
[{"$nulls":11},""]
[{"$nulls":11},""]
[{"$nulls":11},""]
[{"$nulls":11},""]
[{"$nulls":11},""]
[{"$nulls":11},""]
[{"$nulls":11},""]
[{"$nulls":11},""]
[{"$nulls":11},""]
[{"$nulls":11},""]
[{"$nulls":11},""]
[{"$nulls":11},""]
[{"$nulls":11},""]
[{"$nulls":11},""]
[{"$nulls":11},""]
[{"$nulls":11},""]
[{"$nulls":11},""]
[{"$nulls":11},""]
[{"$nulls":11},""]
[{"$nulls":11},""]
[{"$nulls":11},""]
[{"$nulls":11},""]
[{"$nulls":11},""]
[{"$nulls":11},""]
[{"$nulls":11},""]
[{"$nulls":11},""]
[{"$nulls":11},""]
[{"$nulls":11},""]
[{"$nulls":11},""]
[{"$nulls":11},{"$f":"IF(J1305=\"\",\"\",IF(J1305=\"NHVcz\",\"Btu/scf\",IF(J1305=\"NHVdil\",\"Btu/sq ft\",\"\")))","v":""}]
[{"$nulls":11},""]
[{"$nulls":11},""]
[{"$nulls":11},""]
[{"$nulls":11},""]
[{"$nulls":11},""]
[{"$nulls":11},""]
[{"$nulls":11},""]
[{"$nulls":11},""]
[{"$nulls":11},""]
[{"$nulls":11},""]
[{"$nulls":11},""]
[{"$nulls":11},""]
[{"$nulls":11},""]
[{"$nulls":11},""]
[{"$nulls":11},""]
[{"$nulls":11},""]
[{"$nulls":11},""]
[{"$nulls":11},""]
[{"$nulls":11},""]
[{"$nulls":11},""]
[{"$nulls":11},""]
[{"$nulls":11},""]
[{"$nulls":11},""]
[{"$nulls":11},""]
[{"$nulls":11},""]
[{"$nulls":11},""]
[{"$nulls":11},""]
[{"$nulls":11},""]
[{"$nulls":11},""]
[{"$nulls":11},""]
[{"$nulls":11},""]
[{"$nulls":11},""]
[{"$nulls":11},""]
[{"$nulls":11},""]
[{"$nulls":11},""]
[{"$nulls":11},""]
[{"$nulls":11},""]
[{"$nulls":11},""]
[{"$nulls":11},""]
[{"$nulls":11},""]
[{"$nulls":11},""]
[{"$nulls":11},""]
[{"$nulls":11},""]
[{"$nulls":11},""]
[{"$nulls":11},""]
[{"$nulls":11},""]
[{"$nulls":11},""]
[{"$nulls":11},""]
[{"$nulls":11},""]
[{"$nulls":11},""]
[{"$nulls":11},""]
[{"$nulls":11},""]
[{"$nulls":11},""]
[{"$nulls":11},""]
[{"$nulls":11},""]
[{"$nulls":11},""]
[{"$nulls":11},""]
[{"$nulls":11},""]
[{"$nulls":11},""]
[{"$nulls":11},""]
[{"$nulls":11},""]
[{"$nulls":11},""]
[{"$nulls":11},""]
[{"$nulls":11},{"$f":"IF(J1369=\"\",\"\",IF(J1369=\"NHVcz\",\"Btu/scf\",IF(J1369=\"NHVdil\",\"Btu/sq ft\",\"\")))","v":""}]
[{"$nulls":11},""]
[{"$nulls":11},""]
[{"$nulls":11},""]
[{"$nulls":11},""]
[{"$nulls":11},""]
[{"$nulls":11},""]
[{"$nulls":11},""]
[{"$nulls":11},""]
[{"$nulls":11},""]
[{"$nulls":11},""]
[{"$nulls":11},""]
[{"$nulls":11},""]
[{"$nulls":11},""]
[{"$nulls":11},""]
[{"$nulls":11},""]
[{"$nulls":11},""]
[{"$nulls":11},""]
[{"$nulls":11},""]
[{"$nulls":11},""]
[{"$nulls":11},""]
[{"$nulls":11},""]
[{"$nulls":11},""]
[{"$nulls":11},""]
[{"$nulls":11},""]
[{"$nulls":11},""]
[{"$nulls":11},""]
[{"$nulls":11},""]
[{"$nulls":11},""]
[{"$nulls":11},""]
[{"$nulls":11},""]
[{"$nulls":11},""]
[{"$nulls":11},""]
[{"$nulls":11},""]
[{"$nulls":11},""]
[{"$nulls":11},""]
[{"$nulls":11},""]
[{"$nulls":11},""]
[{"$nulls":11},""]
[{"$nulls":11},""]
[{"$nulls":11},""]
[{"$nulls":11},""]
[{"$nulls":11},""]
[{"$nulls":11},""]
[{"$nulls":11},""]
[{"$nulls":11},""]
[{"$nulls":11},""]
[{"$nulls":11},""]
[{"$nulls":11},""]
[{"$nulls":11},""]
[{"$nulls":11},""]
[{"$nulls":11},""]
[{"$nulls":11},""]
[{"$nulls":11},""]
[{"$nulls":11},""]
[{"$nulls":11},""]
[{"$nulls":11},""]
[{"$nulls":11},""]
[{"$nulls":11},""]
[{"$nulls":11},""]
[{"$nulls":11},""]
[{"$nulls":11},""]
[{"$nulls":11},""]
[{"$nulls":11},""]
[{"$nulls":11},{"$f":"IF(J1433=\"\",\"\",IF(J1433=\"NHVcz\",\"Btu/scf\",IF(J1433=\"NHVdil\",\"Btu/sq ft\",\"\")))","v":""}]
[{"$nulls":11},""]
[{"$nulls":11},""]
[{"$nulls":11},""]
[{"$nulls":11},""]
[{"$nulls":11},""]
[{"$nulls":11},""]
[{"$nulls":11},""]
[{"$nulls":11},""]
[{"$nulls":11},""]
[{"$nulls":11},""]
[{"$nulls":11},""]
[{"$nulls":11},""]
[{"$nulls":11},""]
[{"$nulls":11},""]
[{"$nulls":11},""]
[{"$nulls":11},""]
[{"$nulls":11},""]
[{"$nulls":11},""]
[{"$nulls":11},""]
[{"$nulls":11},""]
[{"$nulls":11},""]
[{"$nulls":11},""]
[{"$nulls":11},""]
[{"$nulls":11},""]
[{"$nulls":11},""]
[{"$nulls":11},""]
[{"$nulls":11},""]
[{"$nulls":11},""]
[{"$nulls":11},""]
[{"$nulls":11},""]
[{"$nulls":11},""]
[{"$nulls":11},""]
[{"$nulls":11},""]
[{"$nulls":11},""]
[{"$nulls":11},""]
[{"$nulls":11},""]
[{"$nulls":11},""]
[{"$nulls":11},""]
[{"$nulls":11},""]
[{"$nulls":11},""]
[{"$nulls":11},""]
[{"$nulls":11},""]
[{"$nulls":11},""]
[{"$nulls":11},""]
[{"$nulls":11},""]
[{"$nulls":11},""]
[{"$nulls":11},""]
[{"$nulls":11},""]
[{"$nulls":11},""]
[{"$nulls":11},""]
[{"$nulls":11},""]
[{"$nulls":11},""]
[{"$nulls":11},""]
[{"$nulls":11},""]
[{"$nulls":11},""]
[{"$nulls":11},""]
[{"$nulls":11},""]
[{"$nulls":11},""]
[{"$nulls":11},""]
[{"$nulls":11},""]
[{"$nulls":11},""]
[{"$nulls":11},""]
[{"$nulls":11},""]
[{"$nulls":11},{"$f":"IF(J1497=\"\",\"\",IF(J1497=\"NHVcz\",\"Btu/scf\",IF(J1497=\"NHVdil\",\"Btu/sq ft\",\"\")))","v":""}]
[{"$nulls":11},""]
[{"$nulls":11},""]
[{"$nulls":11},""]
[{"$nulls":11},""]
[{"$nulls":11},""]
[{"$nulls":11},""]
[{"$nulls":11},""]
[{"$nulls":11},""]
[{"$nulls":11},""]
[{"$nulls":11},""]
[{"$nulls":11},""]
[{"$nulls":11},""]
[{"$nulls":11},""]
[{"$nulls":11},""]
[{"$nulls":11},""]
[{"$nulls":11},""]
[{"$nulls":11},""]
[{"$nulls":11},""]
[{"$nulls":11},""]
[{"$nulls":11},""]
[{"$nulls":11},""]
[{"$nulls":11},""]
[{"$nulls":11},""]
[{"$nulls":11},""]
[{"$nulls":11},""]
[{"$nulls":11},""]
[{"$nulls":11},""]
[{"$nulls":11},""]
[{"$nulls":11},""]
[{"$nulls":11},""]
[{"$nulls":11},""]
[{"$nulls":11},""]
[{"$nulls":11},""]
[{"$nulls":11},""]
[{"$nulls":11},""]
[{"$nulls":11},""]
[{"$nulls":11},""]
[{"$nulls":11},""]
[{"$nulls":11},""]
[{"$nulls":11},""]
[{"$nulls":11},""]
[{"$nulls":11},""]
[{"$nulls":11},""]
[{"$nulls":11},""]
[{"$nulls":11},""]
[{"$nulls":11},""]
[{"$nulls":11},""]
[{"$nulls":11},""]
[{"$nulls":11},""]
[{"$nulls":11},""]
[{"$nulls":11},""]
[{"$nulls":11},""]
[{"$nulls":11},""]
[{"$nulls":11},""]
[{"$nulls":11},""]
[{"$nulls":11},""]
[{"$nulls":11},""]
[{"$nulls":11},""]
[{"$nulls":11},""]
[{"$nulls":11},""]
[{"$nulls":11},""]
[{"$nulls":11},""]
[{"$nulls":11},""]
[{"$nulls":11},{"$f":"IF(J1561=\"\",\"\",IF(J1561=\"NHVcz\",\"Btu/scf\",IF(J1561=\"NHVdil\",\"Btu/sq ft\",\"\")))","v":""}]
[{"$nulls":11},""]
[{"$nulls":11},""]
[{"$nulls":11},""]
[{"$nulls":11},""]
[{"$nulls":11},""]
[{"$nulls":11},""]
[{"$nulls":11},""]
[{"$nulls":11},""]
[{"$nulls":11},""]
[{"$nulls":11},""]
[{"$nulls":11},""]
[{"$nulls":11},""]
[{"$nulls":11},""]
[{"$nulls":11},""]
[{"$nulls":11},""]
[{"$nulls":11},""]
[{"$nulls":11},""]
[{"$nulls":11},""]
[{"$nulls":11},""]
[{"$nulls":11},""]
[{"$nulls":11},""]
[{"$nulls":11},""]
[{"$nulls":11},""]
[{"$nulls":11},""]
[{"$nulls":11},""]
[{"$nulls":11},""]
[{"$nulls":11},""]
[{"$nulls":11},""]
[{"$nulls":11},""]
[{"$nulls":11},""]
[{"$nulls":11},""]
[{"$nulls":11},""]
[{"$nulls":11},""]
[{"$nulls":11},""]
[{"$nulls":11},""]
[{"$nulls":11},""]
[{"$nulls":11},""]
[{"$nulls":11},""]
[{"$nulls":11},""]
[{"$nulls":11},""]
[{"$nulls":11},""]
[{"$nulls":11},""]
[{"$nulls":11},""]
[{"$nulls":11},""]
[{"$nulls":11},""]
[{"$nulls":11},""]
[{"$nulls":11},""]
[{"$nulls":11},""]
[{"$nulls":11},""]
[{"$nulls":11},""]
[{"$nulls":11},""]
[{"$nulls":11},""]
[{"$nulls":11},""]
[{"$nulls":11},""]
[{"$nulls":11},""]
[{"$nulls":11},""]
[{"$nulls":11},""]
[{"$nulls":11},""]
[{"$nulls":11},""]
[{"$nulls":11},""]
[{"$nulls":11},""]
[{"$nulls":11},""]
[{"$nulls":11},""]
[{"$nulls":11},{"$f":"IF(J1625=\"\",\"\",IF(J1625=\"NHVcz\",\"Btu/scf\",IF(J1625=\"NHVdil\",\"Btu/sq ft\",\"\")))","v":""}]
[{"$nulls":11},""]
[{"$nulls":11},""]
[{"$nulls":11},""]
[{"$nulls":11},""]
[{"$nulls":11},""]
[{"$nulls":11},""]
[{"$nulls":11},""]
[{"$nulls":11},""]
[{"$nulls":11},""]
[{"$nulls":11},""]
[{"$nulls":11},""]
[{"$nulls":11},""]
[{"$nulls":11},""]
[{"$nulls":11},""]
[{"$nulls":11},""]
[{"$nulls":11},""]
[{"$nulls":11},""]
[{"$nulls":11},""]
[{"$nulls":11},""]
[{"$nulls":11},""]
[{"$nulls":11},""]
[{"$nulls":11},""]
[{"$nulls":11},""]
[{"$nulls":11},""]
[{"$nulls":11},""]
[{"$nulls":11},""]
[{"$nulls":11},""]
[{"$nulls":11},""]
[{"$nulls":11},""]
[{"$nulls":11},""]
[{"$nulls":11},""]
[{"$nulls":11},""]
[{"$nulls":11},""]
[{"$nulls":11},""]
[{"$nulls":11},""]
[{"$nulls":11},""]
[{"$nulls":11},""]
[{"$nulls":11},""]
[{"$nulls":11},""]
[{"$nulls":11},""]
[{"$nulls":11},""]
[{"$nulls":11},""]
[{"$nulls":11},""]
[{"$nulls":11},""]
[{"$nulls":11},""]
[{"$nulls":11},""]
[{"$nulls":11},""]
[{"$nulls":11},""]
[{"$nulls":11},""]
[{"$nulls":11},""]
[{"$nulls":11},""]
[{"$nulls":11},""]
[{"$nulls":11},""]
[{"$nulls":11},""]
[{"$nulls":11},""]
[{"$nulls":11},""]
[{"$nulls":11},""]
[{"$nulls":11},""]
[{"$nulls":11},""]
[{"$nulls":11},""]
[{"$nulls":11},""]
[{"$nulls":11},""]
[{"$nulls":11},""]
[{"$nulls":11},{"$f":"IF(J1689=\"\",\"\",IF(J1689=\"NHVcz\",\"Btu/scf\",IF(J1689=\"NHVdil\",\"Btu/sq ft\",\"\")))","v":""}]
[{"$nulls":11},""]
[{"$nulls":11},""]
[{"$nulls":11},""]
[{"$nulls":11},""]
[{"$nulls":11},""]
[{"$nulls":11},""]
[{"$nulls":11},""]
[{"$nulls":11},""]
[{"$nulls":11},""]
[{"$nulls":11},""]
[{"$nulls":11},""]
[{"$nulls":11},""]
[{"$nulls":11},""]
[{"$nulls":11},""]
[{"$nulls":11},""]
[{"$nulls":11},""]
[{"$nulls":11},""]
[{"$nulls":11},""]
[{"$nulls":11},""]
[{"$nulls":11},""]
[{"$nulls":11},""]
[{"$nulls":11},""]
[{"$nulls":11},""]
[{"$nulls":11},""]
[{"$nulls":11},""]
[{"$nulls":11},""]
[{"$nulls":11},""]
[{"$nulls":11},""]
[{"$nulls":11},""]
[{"$nulls":11},""]
[{"$nulls":11},""]
[{"$nulls":11},""]
[{"$nulls":11},""]
[{"$nulls":11},""]
[{"$nulls":11},""]
[{"$nulls":11},""]
[{"$nulls":11},""]
[{"$nulls":11},""]
[{"$nulls":11},""]
[{"$nulls":11},""]
[{"$nulls":11},""]
[{"$nulls":11},""]
[{"$nulls":11},""]
[{"$nulls":11},""]
[{"$nulls":11},""]
[{"$nulls":11},""]
[{"$nulls":11},""]
[{"$nulls":11},""]
[{"$nulls":11},""]
[{"$nulls":11},""]
[{"$nulls":11},""]
[{"$nulls":11},""]
[{"$nulls":11},""]
[{"$nulls":11},""]
[{"$nulls":11},""]
[{"$nulls":11},""]
[{"$nulls":11},""]
[{"$nulls":11},""]
[{"$nulls":11},""]
[{"$nulls":11},""]
[{"$nulls":11},""]
[{"$nulls":11},""]
[{"$nulls":11},""]
[{"$nulls":11},{"$f":"IF(J1753=\"\",\"\",IF(J1753=\"NHVcz\",\"Btu/scf\",IF(J1753=\"NHVdil\",\"Btu/sq ft\",\"\")))","v":""}]
[{"$nulls":11},""]
[{"$nulls":11},""]
[{"$nulls":11},""]
[{"$nulls":11},""]
[{"$nulls":11},""]
[{"$nulls":11},""]
[{"$nulls":11},""]
[{"$nulls":11},""]
[{"$nulls":11},""]
[{"$nulls":11},""]
[{"$nulls":11},""]
[{"$nulls":11},""]
[{"$nulls":11},""]
[{"$nulls":11},""]
[{"$nulls":11},""]
[{"$nulls":11},""]
[{"$nulls":11},""]
[{"$nulls":11},""]
[{"$nulls":11},""]
[{"$nulls":11},""]
[{"$nulls":11},""]
[{"$nulls":11},""]
[{"$nulls":11},""]
[{"$nulls":11},""]
[{"$nulls":11},""]
[{"$nulls":11},""]
[{"$nulls":11},""]
[{"$nulls":11},""]
[{"$nulls":11},""]
[{"$nulls":11},""]
[{"$nulls":11},""]
[{"$nulls":11},""]
[{"$nulls":11},""]
[{"$nulls":11},""]
[{"$nulls":11},""]
[{"$nulls":11},""]
[{"$nulls":11},""]
[{"$nulls":11},""]
[{"$nulls":11},""]
[{"$nulls":11},""]
[{"$nulls":11},""]
[{"$nulls":11},""]
[{"$nulls":11},""]
[{"$nulls":11},""]
[{"$nulls":11},""]
[{"$nulls":11},""]
[{"$nulls":11},""]
[{"$nulls":11},""]
[{"$nulls":11},""]
[{"$nulls":11},""]
[{"$nulls":11},""]
[{"$nulls":11},""]
[{"$nulls":11},""]
[{"$nulls":11},""]
[{"$nulls":11},""]
[{"$nulls":11},""]
[{"$nulls":11},""]
[{"$nulls":11},""]
[{"$nulls":11},""]
[{"$nulls":11},""]
[{"$nulls":11},""]
[{"$nulls":11},""]
[{"$nulls":11},""]
[{"$nulls":11},{"$f":"IF(J1817=\"\",\"\",IF(J1817=\"NHVcz\",\"Btu/scf\",IF(J1817=\"NHVdil\",\"Btu/sq ft\",\"\")))","v":""}]
[{"$nulls":11},""]
[{"$nulls":11},""]
[{"$nulls":11},""]
[{"$nulls":11},""]
[{"$nulls":11},""]
[{"$nulls":11},""]
[{"$nulls":11},""]
[{"$nulls":11},""]
[{"$nulls":11},""]
[{"$nulls":11},""]
[{"$nulls":11},""]
[{"$nulls":11},""]
[{"$nulls":11},""]
[{"$nulls":11},""]
[{"$nulls":11},""]
[{"$nulls":11},""]
[{"$nulls":11},""]
[{"$nulls":11},""]
[{"$nulls":11},""]
[{"$nulls":11},""]
[{"$nulls":11},""]
[{"$nulls":11},""]
[{"$nulls":11},""]
[{"$nulls":11},""]
[{"$nulls":11},""]
[{"$nulls":11},""]
[{"$nulls":11},""]
[{"$nulls":11},""]
[{"$nulls":11},""]
[{"$nulls":11},""]
[{"$nulls":11},""]
[{"$nulls":11},""]
[{"$nulls":11},""]
[{"$nulls":11},""]
[{"$nulls":11},""]
[{"$nulls":11},""]
[{"$nulls":11},""]
[{"$nulls":11},""]
[{"$nulls":11},""]
[{"$nulls":11},""]
[{"$nulls":11},""]
[{"$nulls":11},""]
[{"$nulls":11},""]
[{"$nulls":11},""]
[{"$nulls":11},""]
[{"$nulls":11},""]
[{"$nulls":11},""]
[{"$nulls":11},""]
[{"$nulls":11},""]
[{"$nulls":11},""]
[{"$nulls":11},""]
[{"$nulls":11},""]
[{"$nulls":11},""]
[{"$nulls":11},""]
[{"$nulls":11},""]
[{"$nulls":11},""]
[{"$nulls":11},""]
[{"$nulls":11},""]
[{"$nulls":11},""]
[{"$nulls":11},""]
[{"$nulls":11},""]
[{"$nulls":11},""]
[{"$nulls":11},""]
[{"$nulls":11},{"$f":"IF(J1881=\"\",\"\",IF(J1881=\"NHVcz\",\"Btu/scf\",IF(J1881=\"NHVdil\",\"Btu/sq ft\",\"\")))","v":""}]
[{"$nulls":11},""]
[{"$nulls":11},""]
[{"$nulls":11},""]
[{"$nulls":11},""]
[{"$nulls":11},""]
[{"$nulls":11},""]
[{"$nulls":11},""]
[{"$nulls":11},""]
[{"$nulls":11},""]
[{"$nulls":11},""]
[{"$nulls":11},""]
[{"$nulls":11},""]
[{"$nulls":11},""]
[{"$nulls":11},""]
[{"$nulls":11},""]
[{"$nulls":11},""]
[{"$nulls":11},""]
[{"$nulls":11},""]
[{"$nulls":11},""]
[{"$nulls":11},""]
[{"$nulls":11},""]
[{"$nulls":11},""]
[{"$nulls":11},""]
[{"$nulls":11},""]
[{"$nulls":11},""]
[{"$nulls":11},""]
[{"$nulls":11},""]
[{"$nulls":11},""]
[{"$nulls":11},""]
[{"$nulls":11},""]
[{"$nulls":11},""]
[{"$nulls":11},""]
[{"$nulls":11},""]
[{"$nulls":11},""]
[{"$nulls":11},""]
[{"$nulls":11},""]
[{"$nulls":11},""]
[{"$nulls":11},""]
[{"$nulls":11},""]
[{"$nulls":11},""]
[{"$nulls":11},""]
[{"$nulls":11},""]
[{"$nulls":11},""]
[{"$nulls":11},""]
[{"$nulls":11},""]
[{"$nulls":11},""]
[{"$nulls":11},""]
[{"$nulls":11},""]
[{"$nulls":11},""]
[{"$nulls":11},""]
[{"$nulls":11},""]
[{"$nulls":11},""]
[{"$nulls":11},""]
[{"$nulls":11},""]
[{"$nulls":11},""]
[{"$nulls":11},""]
[{"$nulls":11},""]
[{"$nulls":11},""]
[{"$nulls":11},""]
[{"$nulls":11},""]
[{"$nulls":11},""]
[{"$nulls":11},""]
[{"$nulls":11},""]
[{"$nulls":11},{"$f":"IF(J1945=\"\",\"\",IF(J1945=\"NHVcz\",\"Btu/scf\",IF(J1945=\"NHVdil\",\"Btu/sq ft\",\"\")))","v":""}]
[{"$nulls":11},""]
[{"$nulls":11},""]
[{"$nulls":11},""]
[{"$nulls":11},""]
[{"$nulls":11},""]
[{"$nulls":11},""]
[{"$nulls":11},""]
[{"$nulls":11},""]
[{"$nulls":11},""]
[{"$nulls":11},""]
[{"$nulls":11},""]
[{"$nulls":11},""]
[{"$nulls":11},""]
[{"$nulls":11},""]
[{"$nulls":11},""]
[{"$nulls":11},""]
[{"$nulls":11},""]
[{"$nulls":11},""]
[{"$nulls":11},""]
[{"$nulls":11},""]
[{"$nulls":11},""]
[{"$nulls":11},""]
[{"$nulls":11},""]
[{"$nulls":11},""]
[{"$nulls":11},""]
[{"$nulls":11},""]
[{"$nulls":11},""]
[{"$nulls":11},""]
[{"$nulls":11},""]
[{"$nulls":11},""]
[{"$nulls":11},""]
[{"$nulls":11},""]
[{"$nulls":11},""]
[{"$nulls":11},""]
[{"$nulls":11},""]
[{"$nulls":11},""]
[{"$nulls":11},""]
[{"$nulls":11},""]
[{"$nulls":11},""]
[{"$nulls":11},""]
[{"$nulls":11},""]
[{"$nulls":11},""]
[{"$nulls":11},""]
[{"$nulls":11},""]
[{"$nulls":11},""]
[{"$nulls":11},""]
[{"$nulls":11},""]
[{"$nulls":11},""]
[{"$nulls":11},""]
[{"$nulls":11},""]
[{"$nulls":11},""]
[{"$nulls":11},""]
[{"$nulls":11},""]
[{"$nulls":11},""]
[{"$nulls":11},""]
[{"$nulls":11},""]
[{"$nulls":11},""]
[{"$nulls":11},""]
[{"$nulls":11},""]
[{"$nulls":11},""]
[{"$nulls":11},""]
[{"$nulls":11},""]
[{"$nulls":11},""]
[{"$nulls":11},{"$f":"IF(J2009=\"\",\"\",IF(J2009=\"NHVcz\",\"Btu/scf\",IF(J2009=\"NHVdil\",\"Btu/sq ft\",\"\")))","v":""}]
[{"$nulls":11},""]
[{"$nulls":11},""]
[{"$nulls":11},""]
[{"$nulls":11},""]
[{"$nulls":11},""]
[{"$nulls":11},""]
[{"$nulls":11},""]
[{"$nulls":11},""]
[{"$nulls":11},""]
[{"$nulls":11},""]
[{"$nulls":11},""]
[{"$nulls":11},""]
[{"$nulls":11},""]
[{"$nulls":11},""]
[{"$nulls":11},""]
[{"$nulls":11},""]
[{"$nulls":11},""]
[{"$nulls":11},""]
[{"$nulls":11},""]
[{"$nulls":11},""]
[{"$nulls":11},""]
[{"$nulls":11},""]
[{"$nulls":11},""]
[{"$nulls":11},""]
[{"$nulls":11},""]
[{"$nulls":11},""]
[{"$nulls":11},""]
[{"$nulls":11},""]
[{"$nulls":11},""]
[{"$nulls":11},""]
[{"$nulls":11},""]
[{"$nulls":11},""]
[{"$nulls":11},""]
[{"$nulls":11},""]
[{"$nulls":11},""]
[{"$nulls":11},""]
[{"$nulls":11},""]
[{"$nulls":11},""]
[{"$nulls":11},""]
[{"$nulls":11},""]
[{"$nulls":11},""]
[{"$nulls":11},""]
[{"$nulls":11},""]
[{"$nulls":11},""]
[{"$nulls":11},""]
[{"$nulls":11},""]
[{"$nulls":11},""]
[{"$nulls":11},""]
[{"$nulls":11},""]
[{"$nulls":11},""]
[{"$nulls":11},""]
[{"$nulls":11},""]
[{"$nulls":11},""]
[{"$nulls":11},""]
[{"$nulls":11},""]
[{"$nulls":11},""]
[{"$nulls":11},""]
[{"$nulls":11},""]
[{"$nulls":11},""]
[{"$nulls":11},""]
[{"$nulls":11},""]
[{"$nulls":11},""]
[{"$nulls":11},""]
[{"$nulls":11},{"$f":"IF(J2073=\"\",\"\",IF(J2073=\"NHVcz\",\"Btu/scf\",IF(J2073=\"NHVdil\",\"Btu/sq ft\",\"\")))","v":""}]
[{"$nulls":11},""]
[{"$nulls":11},""]
[{"$nulls":11},""]
[{"$nulls":11},""]
[{"$nulls":11},""]
[{"$nulls":11},""]
[{"$nulls":11},""]
[{"$nulls":11},""]
[{"$nulls":11},""]
[{"$nulls":11},""]
[{"$nulls":11},""]
[{"$nulls":11},""]
[{"$nulls":11},""]
[{"$nulls":11},""]
[{"$nulls":11},""]
[{"$nulls":11},""]
[{"$nulls":11},""]
[{"$nulls":11},""]
[{"$nulls":11},""]
[{"$nulls":11},""]
[{"$nulls":11},""]
[{"$nulls":11},""]
[{"$nulls":11},""]
[{"$nulls":11},""]
[{"$nulls":11},""]
[{"$nulls":11},""]
[{"$nulls":11},""]
[{"$nulls":11},""]
[{"$nulls":11},""]
[{"$nulls":11},""]
[{"$nulls":11},""]
[{"$nulls":11},""]
[{"$nulls":11},""]
[{"$nulls":11},""]
[{"$nulls":11},""]
[{"$nulls":11},""]
[{"$nulls":11},""]
[{"$nulls":11},""]
[{"$nulls":11},""]
[{"$nulls":11},""]
[{"$nulls":11},""]
[{"$nulls":11},""]
[{"$nulls":11},""]
[{"$nulls":11},""]
[{"$nulls":11},""]
[{"$nulls":11},""]
[{"$nulls":11},""]
[{"$nulls":11},""]
[{"$nulls":11},""]
[{"$nulls":11},""]
[{"$nulls":11},""]
[{"$nulls":11},""]
[{"$nulls":11},""]
[{"$nulls":11},""]
[{"$nulls":11},""]
[{"$nulls":11},""]
[{"$nulls":11},""]
[{"$nulls":11},""]
[{"$nulls":11},""]
[{"$nulls":11},""]
[{"$nulls":11},""]
[{"$nulls":11},""]
[{"$nulls":11},""]
[{"$nulls":11},{"$f":"IF(J2137=\"\",\"\",IF(J2137=\"NHVcz\",\"Btu/scf\",IF(J2137=\"NHVdil\",\"Btu/sq ft\",\"\")))","v":""}]
[{"$nulls":11},""]
[{"$nulls":11},""]
[{"$nulls":11},""]
[{"$nulls":11},""]
[{"$nulls":11},""]
[{"$nulls":11},""]
[{"$nulls":11},""]
[{"$nulls":11},""]
[{"$nulls":11},""]
[{"$nulls":11},""]
[{"$nulls":11},""]
[{"$nulls":11},""]
[{"$nulls":11},""]
[{"$nulls":11},""]
[{"$nulls":11},""]
[{"$nulls":11},""]
[{"$nulls":11},""]
[{"$nulls":11},""]
[{"$nulls":11},""]
[{"$nulls":11},""]
[{"$nulls":11},""]
[{"$nulls":11},""]
[{"$nulls":11},""]
[{"$nulls":11},""]
[{"$nulls":11},""]
[{"$nulls":11},""]
[{"$nulls":11},""]
[{"$nulls":11},""]
[{"$nulls":11},""]
[{"$nulls":11},""]
[{"$nulls":11},""]
[{"$nulls":11},""]
[{"$nulls":11},""]
[{"$nulls":11},""]
[{"$nulls":11},""]
[{"$nulls":11},""]
[{"$nulls":11},""]
[{"$nulls":11},""]
[{"$nulls":11},""]
[{"$nulls":11},""]
[{"$nulls":11},""]
[{"$nulls":11},""]
[{"$nulls":11},""]
[{"$nulls":11},""]
[{"$nulls":11},""]
[{"$nulls":11},""]
[{"$nulls":11},""]
[{"$nulls":11},""]
[{"$nulls":11},""]
[{"$nulls":11},""]
[{"$nulls":11},""]
[{"$nulls":11},""]
[{"$nulls":11},""]
[{"$nulls":11},""]
[{"$nulls":11},""]
[{"$nulls":11},""]
[{"$nulls":11},""]
[{"$nulls":11},""]
[{"$nulls":11},""]
[{"$nulls":11},""]
[{"$nulls":11},""]
[{"$nulls":11},""]
[{"$nulls":11},""]
[{"$nulls":11},{"$f":"IF(J2201=\"\",\"\",IF(J2201=\"NHVcz\",\"Btu/scf\",IF(J2201=\"NHVdil\",\"Btu/sq ft\",\"\")))","v":""}]
[{"$nulls":11},""]
[{"$nulls":11},""]
[{"$nulls":11},""]
[{"$nulls":11},""]
[{"$nulls":11},""]
[{"$nulls":11},""]
[{"$nulls":11},""]
[{"$nulls":11},""]
[{"$nulls":11},""]
[{"$nulls":11},""]
[{"$nulls":11},""]
[{"$nulls":11},""]
[{"$nulls":11},""]
[{"$nulls":11},""]
[{"$nulls":11},""]
[{"$nulls":11},""]
[{"$nulls":11},""]
[{"$nulls":11},""]
[{"$nulls":11},""]
[{"$nulls":11},""]
[{"$nulls":11},""]
[{"$nulls":11},""]
[{"$nulls":11},""]
[{"$nulls":11},""]
[{"$nulls":11},""]
[{"$nulls":11},""]
[{"$nulls":11},""]
[{"$nulls":11},""]
[{"$nulls":11},""]
[{"$nulls":11},""]
[{"$nulls":11},""]
[{"$nulls":11},""]
[{"$nulls":11},""]
[{"$nulls":11},""]
[{"$nulls":11},""]
[{"$nulls":11},""]
[{"$nulls":11},""]
[{"$nulls":11},""]
[{"$nulls":11},""]
[{"$nulls":11},""]
[{"$nulls":11},""]
[{"$nulls":11},""]
[{"$nulls":11},""]
[{"$nulls":11},""]
[{"$nulls":11},""]
[{"$nulls":11},""]
[{"$nulls":11},""]
[{"$nulls":11},""]
[{"$nulls":11},""]
[{"$nulls":11},""]
[{"$nulls":11},""]
[{"$nulls":11},""]
[{"$nulls":11},""]
[{"$nulls":11},""]
[{"$nulls":11},""]
[{"$nulls":11},""]
[{"$nulls":11},""]
[{"$nulls":11},""]
[{"$nulls":11},""]
[{"$nulls":11},""]
[{"$nulls":11},""]
[{"$nulls":11},""]
[{"$nulls":11},""]
[{"$nulls":11},{"$f":"IF(J2265=\"\",\"\",IF(J2265=\"NHVcz\",\"Btu/scf\",IF(J2265=\"NHVdil\",\"Btu/sq ft\",\"\")))","v":""}]
[{"$nulls":11},""]
[{"$nulls":11},""]
[{"$nulls":11},""]
[{"$nulls":11},""]
[{"$nulls":11},""]
[{"$nulls":11},""]
[{"$nulls":11},""]
[{"$nulls":11},""]
[{"$nulls":11},""]
[{"$nulls":11},""]
[{"$nulls":11},""]
[{"$nulls":11},""]
[{"$nulls":11},""]
[{"$nulls":11},""]
[{"$nulls":11},""]
[{"$nulls":11},""]
[{"$nulls":11},""]
[{"$nulls":11},""]
[{"$nulls":11},""]
[{"$nulls":11},""]
[{"$nulls":11},""]
[{"$nulls":11},""]
[{"$nulls":11},""]
[{"$nulls":11},""]
[{"$nulls":11},""]
[{"$nulls":11},""]
[{"$nulls":11},""]
[{"$nulls":11},""]
[{"$nulls":11},""]
[{"$nulls":11},""]
[{"$nulls":11},""]
[{"$nulls":11},""]
[{"$nulls":11},""]
[{"$nulls":11},""]
[{"$nulls":11},""]
[{"$nulls":11},""]
[{"$nulls":11},""]
[{"$nulls":11},""]
[{"$nulls":11},""]
[{"$nulls":11},""]
[{"$nulls":11},""]
[{"$nulls":11},""]
[{"$nulls":11},""]
[{"$nulls":11},""]
[{"$nulls":11},""]
[{"$nulls":11},""]
[{"$nulls":11},""]
[{"$nulls":11},""]
[{"$nulls":11},""]
[{"$nulls":11},""]
[{"$nulls":11},""]
[{"$nulls":11},""]
[{"$nulls":11},""]
[{"$nulls":11},""]
[{"$nulls":11},""]
[{"$nulls":11},""]
[{"$nulls":11},""]
[{"$nulls":11},""]
[{"$nulls":11},""]
[{"$nulls":11},""]
[{"$nulls":11},""]
[{"$nulls":11},""]
[{"$nulls":11},""]
[{"$nulls":11},{"$f":"IF(J2329=\"\",\"\",IF(J2329=\"NHVcz\",\"Btu/scf\",IF(J2329=\"NHVdil\",\"Btu/sq ft\",\"\")))","v":""}]
[{"$nulls":11},""]
[{"$nulls":11},""]
[{"$nulls":11},""]
[{"$nulls":11},""]
[{"$nulls":11},""]
[{"$nulls":11},""]
[{"$nulls":11},""]
[{"$nulls":11},""]
[{"$nulls":11},""]
[{"$nulls":11},""]
[{"$nulls":11},""]
[{"$nulls":11},""]
[{"$nulls":11},""]
[{"$nulls":11},""]
[{"$nulls":11},""]
[{"$nulls":11},""]
[{"$nulls":11},""]
[{"$nulls":11},""]
[{"$nulls":11},""]
[{"$nulls":11},""]
[{"$nulls":11},""]
[{"$nulls":11},""]
[{"$nulls":11},""]
[{"$nulls":11},""]
[{"$nulls":11},""]
[{"$nulls":11},""]
[{"$nulls":11},""]
[{"$nulls":11},""]
[{"$nulls":11},""]
[{"$nulls":11},""]
[{"$nulls":11},""]
[{"$nulls":11},""]
[{"$nulls":11},""]
[{"$nulls":11},""]
[{"$nulls":11},""]
[{"$nulls":11},""]
[{"$nulls":11},""]
[{"$nulls":11},""]
[{"$nulls":11},""]
[{"$nulls":11},""]
[{"$nulls":11},""]
[{"$nulls":11},""]
[{"$nulls":11},""]
[{"$nulls":11},""]
[{"$nulls":11},""]
[{"$nulls":11},""]
[{"$nulls":11},""]
[{"$nulls":11},""]
[{"$nulls":11},""]
[{"$nulls":11},""]
[{"$nulls":11},""]
[{"$nulls":11},""]
[{"$nulls":11},""]
[{"$nulls":11},""]
[{"$nulls":11},""]
[{"$nulls":11},""]
[{"$nulls":11},""]
[{"$nulls":11},""]
[{"$nulls":11},""]
[{"$nulls":11},""]
[{"$nulls":11},""]
[{"$nulls":11},""]
[{"$nulls":11},""]
[{"$nulls":11},{"$f":"IF(J2393=\"\",\"\",IF(J2393=\"NHVcz\",\"Btu/scf\",IF(J2393=\"NHVdil\",\"Btu/sq ft\",\"\")))","v":""}]
[{"$nulls":11},""]
[{"$nulls":11},""]
[{"$nulls":11},""]
[{"$nulls":11},""]
[{"$nulls":11},""]
[{"$nulls":11},""]
[{"$nulls":11},""]
[{"$nulls":11},""]
[{"$nulls":11},""]
[{"$nulls":11},""]
[{"$nulls":11},""]
[{"$nulls":11},""]
[{"$nulls":11},""]
[{"$nulls":11},""]
[{"$nulls":11},""]
[{"$nulls":11},""]
[{"$nulls":11},""]
[{"$nulls":11},""]
[{"$nulls":11},""]
[{"$nulls":11},""]
[{"$nulls":11},""]
[{"$nulls":11},""]
[{"$nulls":11},""]
[{"$nulls":11},""]
[{"$nulls":11},""]
[{"$nulls":11},""]
[{"$nulls":11},""]
[{"$nulls":11},""]
[{"$nulls":11},""]
[{"$nulls":11},""]
[{"$nulls":11},""]
[{"$nulls":11},""]
[{"$nulls":11},""]
[{"$nulls":11},""]
[{"$nulls":11},""]
[{"$nulls":11},""]
[{"$nulls":11},""]
[{"$nulls":11},""]
[{"$nulls":11},""]
[{"$nulls":11},""]
[{"$nulls":11},""]
[{"$nulls":11},""]
[{"$nulls":11},""]
[{"$nulls":11},""]
[{"$nulls":11},""]
[{"$nulls":11},""]
[{"$nulls":11},""]
[{"$nulls":11},""]
[{"$nulls":11},""]
[{"$nulls":11},""]
[{"$nulls":11},""]
[{"$nulls":11},""]
[{"$nulls":11},""]
[{"$nulls":11},""]
[{"$nulls":11},""]
[{"$nulls":11},""]
[{"$nulls":11},""]
[{"$nulls":11},""]
[{"$nulls":11},""]
[{"$nulls":11},""]
[{"$nulls":11},""]
[{"$nulls":11},""]
[{"$nulls":11},""]
[{"$nulls":11},{"$f":"IF(J2457=\"\",\"\",IF(J2457=\"NHVcz\",\"Btu/scf\",IF(J2457=\"NHVdil\",\"Btu/sq ft\",\"\")))","v":""}]
[{"$nulls":11},""]
[{"$nulls":11},""]
[{"$nulls":11},""]
[{"$nulls":11},""]
[{"$nulls":11},""]
[{"$nulls":11},""]
[{"$nulls":11},""]
[{"$nulls":11},""]
[{"$nulls":11},""]
[{"$nulls":11},""]
[{"$nulls":11},""]
[{"$nulls":11},""]
[{"$nulls":11},""]
[{"$nulls":11},""]
[{"$nulls":11},""]
[{"$nulls":11},""]
[{"$nulls":11},""]
[{"$nulls":11},""]
[{"$nulls":11},""]
[{"$nulls":11},""]
[{"$nulls":11},""]
[{"$nulls":11},""]
[{"$nulls":11},""]
[{"$nulls":11},""]
[{"$nulls":11},""]
[{"$nulls":11},""]
[{"$nulls":11},""]
[{"$nulls":11},""]
[{"$nulls":11},""]
[{"$nulls":11},""]
[{"$nulls":11},""]
[{"$nulls":11},""]
[{"$nulls":11},""]
[{"$nulls":11},""]
[{"$nulls":11},""]
[{"$nulls":11},""]
[{"$nulls":11},""]
[{"$nulls":11},""]
[{"$nulls":11},""]
[{"$nulls":11},""]
[{"$nulls":11},""]
[{"$nulls":11},""]
[{"$nulls":11},""]
[{"$nulls":11},""]
[{"$nulls":11},""]
[{"$nulls":11},""]
[{"$nulls":11},""]
[{"$nulls":11},""]
[{"$nulls":11},""]
[{"$nulls":11},""]
[{"$nulls":11},""]
[{"$nulls":11},""]
[{"$nulls":11},""]
[{"$nulls":11},""]
[{"$nulls":11},""]
[{"$nulls":11},""]
[{"$nulls":11},""]
[{"$nulls":11},""]
[{"$nulls":11},""]
[{"$nulls":11},""]
[{"$nulls":11},""]
[{"$nulls":11},""]
[{"$nulls":11},""]
[{"$nulls":11},{"$f":"IF(J2521=\"\",\"\",IF(J2521=\"NHVcz\",\"Btu/scf\",IF(J2521=\"NHVdil\",\"Btu/sq ft\",\"\")))","v":""}]
[{"$nulls":11},""]
[{"$nulls":11},""]
[{"$nulls":11},""]
[{"$nulls":11},""]
[{"$nulls":11},""]
[{"$nulls":11},""]
[{"$nulls":11},""]
[{"$nulls":11},""]
[{"$nulls":11},""]
[{"$nulls":11},""]
[{"$nulls":11},""]
[{"$nulls":11},""]
[{"$nulls":11},""]
[{"$nulls":11},""]
[{"$nulls":11},""]
[{"$nulls":11},""]
[{"$nulls":11},""]
[{"$nulls":11},""]
[{"$nulls":11},""]
[{"$nulls":11},""]
[{"$nulls":11},""]
[{"$nulls":11},""]
[{"$nulls":11},""]
[{"$nulls":11},""]
[{"$nulls":11},""]
[{"$nulls":11},""]
[{"$nulls":11},""]
[{"$nulls":11},""]
[{"$nulls":11},""]
[{"$nulls":11},""]
[{"$nulls":11},""]
[{"$nulls":11},""]
[{"$nulls":11},""]
[{"$nulls":11},""]
[{"$nulls":11},""]
[{"$nulls":11},""]
[{"$nulls":11},""]
[{"$nulls":11},""]
[{"$nulls":11},""]
[{"$nulls":11},""]
[{"$nulls":11},""]
[{"$nulls":11},""]
[{"$nulls":11},""]
[{"$nulls":11},""]
[{"$nulls":11},""]
[{"$nulls":11},""]
[{"$nulls":11},""]
[{"$nulls":11},""]
[{"$nulls":11},""]
[{"$nulls":11},""]
[{"$nulls":11},""]
[{"$nulls":11},""]
[{"$nulls":11},""]
[{"$nulls":11},""]
[{"$nulls":11},""]
[{"$nulls":11},""]
[{"$nulls":11},""]
[{"$nulls":11},""]
[{"$nulls":11},""]
[{"$nulls":11},""]
[{"$nulls":11},""]
[{"$nulls":11},""]
[{"$nulls":11},""]
[{"$nulls":11},{"$f":"IF(J2585=\"\",\"\",IF(J2585=\"NHVcz\",\"Btu/scf\",IF(J2585=\"NHVdil\",\"Btu/sq ft\",\"\")))","v":""}]
[{"$nulls":11},""]
[{"$nulls":11},""]
[{"$nulls":11},""]
[{"$nulls":11},""]
[{"$nulls":11},""]
[{"$nulls":11},""]
[{"$nulls":11},""]
[{"$nulls":11},""]
[{"$nulls":11},""]
[{"$nulls":11},""]
[{"$nulls":11},""]
[{"$nulls":11},""]
[{"$nulls":11},""]
[{"$nulls":11},""]
[{"$nulls":11},""]
[{"$nulls":11},""]
[{"$nulls":11},""]
[{"$nulls":11},""]
[{"$nulls":11},""]
[{"$nulls":11},""]
[{"$nulls":11},""]
[{"$nulls":11},""]
[{"$nulls":11},""]
[{"$nulls":11},""]
[{"$nulls":11},""]
[{"$nulls":11},""]
[{"$nulls":11},""]
[{"$nulls":11},""]
[{"$nulls":11},""]
[{"$nulls":11},""]
[{"$nulls":11},""]
[{"$nulls":11},""]
[{"$nulls":11},""]
[{"$nulls":11},""]
[{"$nulls":11},""]
[{"$nulls":11},""]
[{"$nulls":11},""]
[{"$nulls":11},""]
[{"$nulls":11},""]
[{"$nulls":11},""]
[{"$nulls":11},""]
[{"$nulls":11},""]
[{"$nulls":11},""]
[{"$nulls":11},""]
[{"$nulls":11},""]
[{"$nulls":11},""]
[{"$nulls":11},""]
[{"$nulls":11},""]
[{"$nulls":11},""]
[{"$nulls":11},""]
[{"$nulls":11},""]
[{"$nulls":11},""]
[{"$nulls":11},""]
[{"$nulls":11},""]
[{"$nulls":11},""]
[{"$nulls":11},""]
[{"$nulls":11},""]
[{"$nulls":11},""]
[{"$nulls":11},""]
[{"$nulls":11},""]
[{"$nulls":11},""]
[{"$nulls":11},""]
[{"$nulls":11},""]
[{"$nulls":11},{"$f":"IF(J2649=\"\",\"\",IF(J2649=\"NHVcz\",\"Btu/scf\",IF(J2649=\"NHVdil\",\"Btu/sq ft\",\"\")))","v":""}]
[{"$nulls":11},""]
[{"$nulls":11},""]
[{"$nulls":11},""]
[{"$nulls":11},""]
[{"$nulls":11},""]
[{"$nulls":11},""]
[{"$nulls":11},""]
[{"$nulls":11},""]
[{"$nulls":11},""]
[{"$nulls":11},""]
[{"$nulls":11},""]
[{"$nulls":11},""]
[{"$nulls":11},""]
[{"$nulls":11},""]
[{"$nulls":11},""]
[{"$nulls":11},""]
[{"$nulls":11},""]
[{"$nulls":11},""]
[{"$nulls":11},""]
[{"$nulls":11},""]
[{"$nulls":11},""]
[{"$nulls":11},""]
[{"$nulls":11},""]
[{"$nulls":11},""]
[{"$nulls":11},""]
[{"$nulls":11},""]
[{"$nulls":11},""]
[{"$nulls":11},""]
[{"$nulls":11},""]
[{"$nulls":11},""]
[{"$nulls":11},""]
[{"$nulls":11},""]
[{"$nulls":11},""]
[{"$nulls":11},""]
[{"$nulls":11},""]
[{"$nulls":11},""]
[{"$nulls":11},""]
[{"$nulls":11},""]
[{"$nulls":11},""]
[{"$nulls":11},""]
[{"$nulls":11},""]
[{"$nulls":11},""]
[{"$nulls":11},""]
[{"$nulls":11},""]
[{"$nulls":11},""]
[{"$nulls":11},""]
[{"$nulls":11},""]
[{"$nulls":11},""]
[{"$nulls":11},""]
[{"$nulls":11},""]
[{"$nulls":11},""]
[{"$nulls":11},""]
[{"$nulls":11},""]
[{"$nulls":11},""]
[{"$nulls":11},""]
[{"$nulls":11},""]
[{"$nulls":11},""]
[{"$nulls":11},""]
[{"$nulls":11},""]
[{"$nulls":11},""]
[{"$nulls":11},""]
[{"$nulls":11},""]
[{"$nulls":11},""]
[{"$nulls":11},{"$f":"IF(J2713=\"\",\"\",IF(J2713=\"NHVcz\",\"Btu/scf\",IF(J2713=\"NHVdil\",\"Btu/sq ft\",\"\")))","v":""}]
[{"$nulls":11},""]
[{"$nulls":11},""]
[{"$nulls":11},""]
[{"$nulls":11},""]
[{"$nulls":11},""]
[{"$nulls":11},""]
[{"$nulls":11},""]
[{"$nulls":11},""]
[{"$nulls":11},""]
[{"$nulls":11},""]
[{"$nulls":11},""]
[{"$nulls":11},""]
[{"$nulls":11},""]
[{"$nulls":11},""]
[{"$nulls":11},""]
[{"$nulls":11},""]
[{"$nulls":11},""]
[{"$nulls":11},""]
[{"$nulls":11},""]
[{"$nulls":11},""]
[{"$nulls":11},""]
[{"$nulls":11},""]
[{"$nulls":11},""]
[{"$nulls":11},""]
[{"$nulls":11},""]
[{"$nulls":11},""]
[{"$nulls":11},""]
[{"$nulls":11},""]
[{"$nulls":11},""]
[{"$nulls":11},""]
[{"$nulls":11},""]
[{"$nulls":11},""]
[{"$nulls":11},""]
[{"$nulls":11},""]
[{"$nulls":11},""]
[{"$nulls":11},""]
[{"$nulls":11},""]
[{"$nulls":11},""]
[{"$nulls":11},""]
[{"$nulls":11},""]
[{"$nulls":11},""]
[{"$nulls":11},""]
[{"$nulls":11},""]
[{"$nulls":11},""]
[{"$nulls":11},""]
[{"$nulls":11},""]
[{"$nulls":11},""]
[{"$nulls":11},""]
[{"$nulls":11},""]
[{"$nulls":11},""]
[{"$nulls":11},""]
[{"$nulls":11},""]
[{"$nulls":11},""]
[{"$nulls":11},""]
[{"$nulls":11},""]
[{"$nulls":11},""]
[{"$nulls":11},""]
[{"$nulls":11},""]
[{"$nulls":11},""]
[{"$nulls":11},""]
[{"$nulls":11},""]
[{"$nulls":11},""]
[{"$nulls":11},""]
[{"$nulls":11},{"$f":"IF(J2777=\"\",\"\",IF(J2777=\"NHVcz\",\"Btu/scf\",IF(J2777=\"NHVdil\",\"Btu/sq ft\",\"\")))","v":""}]
[{"$nulls":11},""]
[{"$nulls":11},""]
[{"$nulls":11},""]
[{"$nulls":11},""]
[{"$nulls":11},""]
[{"$nulls":11},""]
[{"$nulls":11},""]
[{"$nulls":11},""]
[{"$nulls":11},""]
[{"$nulls":11},""]
[{"$nulls":11},""]
[{"$nulls":11},""]
[{"$nulls":11},""]
[{"$nulls":11},""]
[{"$nulls":11},""]
[{"$nulls":11},""]
[{"$nulls":11},""]
[{"$nulls":11},""]
[{"$nulls":11},""]
[{"$nulls":11},""]
[{"$nulls":11},""]
[{"$nulls":11},""]
[{"$nulls":11},""]
[{"$nulls":11},""]
[{"$nulls":11},""]
[{"$nulls":11},""]
[{"$nulls":11},""]
[{"$nulls":11},""]
[{"$nulls":11},""]
[{"$nulls":11},""]
[{"$nulls":11},""]
[{"$nulls":11},""]
[{"$nulls":11},""]
[{"$nulls":11},""]
[{"$nulls":11},""]
[{"$nulls":11},""]
[{"$nulls":11},""]
[{"$nulls":11},""]
[{"$nulls":11},""]
[{"$nulls":11},""]
[{"$nulls":11},""]
[{"$nulls":11},""]
[{"$nulls":11},""]
[{"$nulls":11},""]
[{"$nulls":11},""]
[{"$nulls":11},""]
[{"$nulls":11},""]
[{"$nulls":11},""]
[{"$nulls":11},""]
[{"$nulls":11},""]
[{"$nulls":11},""]
[{"$nulls":11},""]
[{"$nulls":11},""]
[{"$nulls":11},""]
[{"$nulls":11},""]
[{"$nulls":11},""]
[{"$nulls":11},""]
[{"$nulls":11},""]
[{"$nulls":11},""]
[{"$nulls":11},""]
[{"$nulls":11},""]
[{"$nulls":11},""]
[{"$nulls":11},""]
[{"$nulls":11},{"$f":"IF(J2841=\"\",\"\",IF(J2841=\"NHVcz\",\"Btu/scf\",IF(J2841=\"NHVdil\",\"Btu/sq ft\",\"\")))","v":""}]
[{"$nulls":11},""]
[{"$nulls":11},""]
[{"$nulls":11},""]
[{"$nulls":11},""]
[{"$nulls":11},""]
[{"$nulls":11},""]
[{"$nulls":11},""]
[{"$nulls":11},""]
[{"$nulls":11},""]
[{"$nulls":11},""]
[{"$nulls":11},""]
[{"$nulls":11},""]
[{"$nulls":11},""]
[{"$nulls":11},""]
[{"$nulls":11},""]
[{"$nulls":11},""]
[{"$nulls":11},""]
[{"$nulls":11},""]
[{"$nulls":11},""]
[{"$nulls":11},""]
[{"$nulls":11},""]
[{"$nulls":11},""]
[{"$nulls":11},""]
[{"$nulls":11},""]
[{"$nulls":11},""]
[{"$nulls":11},""]
[{"$nulls":11},""]
[{"$nulls":11},""]
[{"$nulls":11},""]
[{"$nulls":11},""]
[{"$nulls":11},""]
[{"$nulls":11},""]
[{"$nulls":11},""]
[{"$nulls":11},""]
[{"$nulls":11},""]
[{"$nulls":11},""]
[{"$nulls":11},""]
[{"$nulls":11},""]
[{"$nulls":11},""]
[{"$nulls":11},""]
[{"$nulls":11},""]
[{"$nulls":11},""]
[{"$nulls":11},""]
[{"$nulls":11},""]
[{"$nulls":11},""]
[{"$nulls":11},""]
[{"$nulls":11},""]
[{"$nulls":11},""]
[{"$nulls":11},""]
[{"$nulls":11},""]
[{"$nulls":11},""]
[{"$nulls":11},""]
[{"$nulls":11},""]
[{"$nulls":11},""]
[{"$nulls":11},""]
[{"$nulls":11},""]
[{"$nulls":11},""]
[{"$nulls":11},""]
[{"$nulls":11},""]
[{"$nulls":11},""]
[{"$nulls":11},""]
[{"$nulls":11},""]
[{"$nulls":11},""]
[{"$nulls":11},{"$f":"IF(J2905=\"\",\"\",IF(J2905=\"NHVcz\",\"Btu/scf\",IF(J2905=\"NHVdil\",\"Btu/sq ft\",\"\")))","v":""}]
[{"$nulls":11},""]
[{"$nulls":11},""]
[{"$nulls":11},""]
[{"$nulls":11},""]
[{"$nulls":11},""]
[{"$nulls":11},""]
[{"$nulls":11},""]
[{"$nulls":11},""]
[{"$nulls":11},""]
[{"$nulls":11},""]
[{"$nulls":11},""]
[{"$nulls":11},""]
[{"$nulls":11},""]
[{"$nulls":11},""]
[{"$nulls":11},""]
[{"$nulls":11},""]
[{"$nulls":11},""]
[{"$nulls":11},""]
[{"$nulls":11},""]
[{"$nulls":11},""]
[{"$nulls":11},""]
[{"$nulls":11},""]
[{"$nulls":11},""]
[{"$nulls":11},""]
[{"$nulls":11},""]
[{"$nulls":11},""]
[{"$nulls":11},""]
[{"$nulls":11},""]
[{"$nulls":11},""]
[{"$nulls":11},""]
[{"$nulls":11},""]
[{"$nulls":11},""]
[{"$nulls":11},""]
[{"$nulls":11},""]
[{"$nulls":11},""]
[{"$nulls":11},""]
[{"$nulls":11},""]
[{"$nulls":11},""]
[{"$nulls":11},""]
[{"$nulls":11},""]
[{"$nulls":11},""]
[{"$nulls":11},""]
[{"$nulls":11},""]
[{"$nulls":11},""]
[{"$nulls":11},""]
[{"$nulls":11},""]
[{"$nulls":11},""]
[{"$nulls":11},""]
[{"$nulls":11},""]
[{"$nulls":11},""]
[{"$nulls":11},""]
[{"$nulls":11},""]
[{"$nulls":11},""]
[{"$nulls":11},""]
[{"$nulls":11},""]
[{"$nulls":11},""]
[{"$nulls":11},""]
[{"$nulls":11},""]
[{"$nulls":11},""]
[{"$nulls":11},""]
[{"$nulls":11},""]
[{"$nulls":11},""]
[{"$nulls":11},""]
[{"$nulls":11},{"$f":"IF(J2969=\"\",\"\",IF(J2969=\"NHVcz\",\"Btu/scf\",IF(J2969=\"NHVdil\",\"Btu/sq ft\",\"\")))","v":""}]
[{"$nulls":11},""]
[{"$nulls":11},""]
[{"$nulls":11},""]
[{"$nulls":11},""]
[{"$nulls":11},""]
[{"$nulls":11},""]
[{"$nulls":11},""]
[{"$nulls":11},""]
[{"$nulls":11},""]
[{"$nulls":11},""]
[{"$nulls":11},""]
[{"$nulls":11},""]
[{"$nulls":11},""]
[{"$nulls":11},""]
[{"$nulls":11},""]
[{"$nulls":11},""]
[{"$nulls":11},""]
[{"$nulls":11},""]
[{"$nulls":11},""]
[{"$nulls":11},""]
[{"$nulls":11},""]
[{"$nulls":11},""]
[{"$nulls":11},""]
[{"$nulls":11},""]
[{"$nulls":11},""]
[{"$nulls":11},""]
[{"$nulls":11},""]
[{"$nulls":11},""]
[{"$nulls":11},""]
[{"$nulls":11},""]
[{"$nulls":11},""]
[{"$nulls":11},""]
[{"$nulls":11},""]
[{"$nulls":11},""]
[{"$nulls":11},""]
[{"$nulls":11},""]
[{"$nulls":11},""]
[{"$nulls":11},""]
[{"$nulls":11},""]
[{"$nulls":11},""]
[{"$nulls":11},""]
[{"$nulls":11},""]
[{"$nulls":11},""]
[{"$nulls":11},""]
[{"$nulls":11},""]
[{"$nulls":11},""]
[{"$nulls":11},""]
[{"$nulls":11},""]
[{"$nulls":11},""]
[{"$nulls":11},""]
[{"$nulls":11},""]
[{"$nulls":11},""]
[{"$nulls":11},""]
[{"$nulls":11},""]
[{"$nulls":11},""]
[{"$nulls":11},""]
[{"$nulls":11},""]
[{"$nulls":11},""]
[{"$nulls":11},""]
[{"$nulls":11},""]
[{"$nulls":11},""]
[{"$nulls":11},""]
[{"$nulls":11},""]
[{"$nulls":11},{"$f":"IF(J3033=\"\",\"\",IF(J3033=\"NHVcz\",\"Btu/scf\",IF(J3033=\"NHVdil\",\"Btu/sq ft\",\"\")))","v":""}]
[{"$nulls":11},""]
[{"$nulls":11},""]
[{"$nulls":11},""]
[{"$nulls":11},""]
[{"$nulls":11},""]
[{"$nulls":11},""]
[{"$nulls":11},""]
[{"$nulls":11},""]
[{"$nulls":11},""]
[{"$nulls":11},""]
[{"$nulls":11},""]
[{"$nulls":11},""]
[{"$nulls":11},""]
[{"$nulls":11},""]
[{"$nulls":11},""]
[{"$nulls":11},""]
[{"$nulls":11},""]
[{"$nulls":11},""]
[{"$nulls":11},""]
[{"$nulls":11},""]
[{"$nulls":11},""]
[{"$nulls":11},""]
[{"$nulls":11},""]
[{"$nulls":11},""]
[{"$nulls":11},""]
[{"$nulls":11},""]
[{"$nulls":11},""]
[{"$nulls":11},""]
[{"$nulls":11},""]
[{"$nulls":11},""]
[{"$nulls":11},""]
[{"$nulls":11},""]
[{"$nulls":11},""]
[{"$nulls":11},""]
[{"$nulls":11},""]
[{"$nulls":11},""]
[{"$nulls":11},""]
[{"$nulls":11},""]
[{"$nulls":11},""]
[{"$nulls":11},""]
[{"$nulls":11},""]
[{"$nulls":11},""]
[{"$nulls":11},""]
[{"$nulls":11},""]
[{"$nulls":11},""]
[{"$nulls":11},""]
[{"$nulls":11},""]
[{"$nulls":11},""]
[{"$nulls":11},""]
[{"$nulls":11},""]
[{"$nulls":11},""]
[{"$nulls":11},""]
[{"$nulls":11},""]
[{"$nulls":11},""]
[{"$nulls":11},""]
[{"$nulls":11},""]
[{"$nulls":11},""]
[{"$nulls":11},""]
[{"$nulls":11},""]
[{"$nulls":11},""]
[{"$nulls":11},""]
[{"$nulls":11},""]
[{"$nulls":11},""]
[{"$nulls":11},{"$f":"IF(J3097=\"\",\"\",IF(J3097=\"NHVcz\",\"Btu/scf\",IF(J3097=\"NHVdil\",\"Btu/sq ft\",\"\")))","v":""}]
[{"$nulls":11},""]
[{"$nulls":11},""]
[{"$nulls":11},""]
[{"$nulls":11},""]
[{"$nulls":11},""]
[{"$nulls":11},""]
[{"$nulls":11},""]
[{"$nulls":11},""]
[{"$nulls":11},""]
[{"$nulls":11},""]
[{"$nulls":11},""]
[{"$nulls":11},""]
[{"$nulls":11},""]
[{"$nulls":11},""]
[{"$nulls":11},""]
[{"$nulls":11},""]
[{"$nulls":11},""]
[{"$nulls":11},""]
[{"$nulls":11},""]
[{"$nulls":11},""]
[{"$nulls":11},""]
[{"$nulls":11},""]
[{"$nulls":11},""]
[{"$nulls":11},""]
[{"$nulls":11},""]
[{"$nulls":11},""]
[{"$nulls":11},""]
[{"$nulls":11},""]
[{"$nulls":11},""]
[{"$nulls":11},""]
[{"$nulls":11},""]
[{"$nulls":11},""]
[{"$nulls":11},""]
[{"$nulls":11},""]
[{"$nulls":11},""]
[{"$nulls":11},""]
[{"$nulls":11},""]
[{"$nulls":11},""]
[{"$nulls":11},""]
[{"$nulls":11},""]
[{"$nulls":11},""]
[{"$nulls":11},""]
[{"$nulls":11},""]
[{"$nulls":11},""]
[{"$nulls":11},""]
[{"$nulls":11},""]
[{"$nulls":11},""]
[{"$nulls":11},""]
[{"$nulls":11},""]
[{"$nulls":11},""]
[{"$nulls":11},""]
[{"$nulls":11},""]
[{"$nulls":11},""]
[{"$nulls":11},""]
[{"$nulls":11},""]
[{"$nulls":11},""]
[{"$nulls":11},""]
[{"$nulls":11},""]
[{"$nulls":11},""]
[{"$nulls":11},""]
[{"$nulls":11},""]
[{"$nulls":11},""]
[{"$nulls":11},""]
[{"$nulls":11},{"$f":"IF(J3161=\"\",\"\",IF(J3161=\"NHVcz\",\"Btu/scf\",IF(J3161=\"NHVdil\",\"Btu/sq ft\",\"\")))","v":""}]
[{"$nulls":11},""]
[{"$nulls":11},""]
[{"$nulls":11},""]
[{"$nulls":11},""]
[{"$nulls":11},""]
[{"$nulls":11},""]
[{"$nulls":11},""]
[{"$nulls":11},""]
[{"$nulls":11},""]
[{"$nulls":11},""]
[{"$nulls":11},""]
[{"$nulls":11},""]
[{"$nulls":11},""]
[{"$nulls":11},""]
[{"$nulls":11},""]
[{"$nulls":11},""]
[{"$nulls":11},""]
[{"$nulls":11},""]
[{"$nulls":11},""]
[{"$nulls":11},""]
[{"$nulls":11},""]
[{"$nulls":11},""]
[{"$nulls":11},""]
[{"$nulls":11},""]
[{"$nulls":11},""]
[{"$nulls":11},""]
[{"$nulls":11},""]
[{"$nulls":11},""]
[{"$nulls":11},""]
[{"$nulls":11},""]
[{"$nulls":11},""]
[{"$nulls":11},""]
[{"$nulls":11},""]
[{"$nulls":11},""]
[{"$nulls":11},""]
[{"$nulls":11},""]
[{"$nulls":11},""]
[{"$nulls":11},""]
[{"$nulls":11},""]
[{"$nulls":11},""]
[{"$nulls":11},""]
[{"$nulls":11},""]
[{"$nulls":11},""]
[{"$nulls":11},""]
[{"$nulls":11},""]
[{"$nulls":11},""]
[{"$nulls":11},""]
[{"$nulls":11},""]
[{"$nulls":11},""]
[{"$nulls":11},""]
[{"$nulls":11},""]
[{"$nulls":11},""]
[{"$nulls":11},""]
[{"$nulls":11},""]
[{"$nulls":11},""]
[{"$nulls":11},""]
[{"$nulls":11},""]
[{"$nulls":11},""]
[{"$nulls":11},""]
[{"$nulls":11},""]
[{"$nulls":11},""]
[{"$nulls":11},""]
[{"$nulls":11},""]
[{"$nulls":11},{"$f":"IF(J3225=\"\",\"\",IF(J3225=\"NHVcz\",\"Btu/scf\",IF(J3225=\"NHVdil\",\"Btu/sq ft\",\"\")))","v":""}]
[{"$nulls":11},""]
[{"$nulls":11},""]
[{"$nulls":11},""]
[{"$nulls":11},""]
[{"$nulls":11},""]
[{"$nulls":11},""]
[{"$nulls":11},""]
[{"$nulls":11},""]
[{"$nulls":11},""]
[{"$nulls":11},""]
[{"$nulls":11},""]
[{"$nulls":11},""]
[{"$nulls":11},""]
[{"$nulls":11},""]
[{"$nulls":11},""]
[{"$nulls":11},""]
[{"$nulls":11},""]
[{"$nulls":11},""]
[{"$nulls":11},""]
[{"$nulls":11},""]
[{"$nulls":11},""]
[{"$nulls":11},""]
[{"$nulls":11},""]
[{"$nulls":11},""]
[{"$nulls":11},""]
[{"$nulls":11},""]
[{"$nulls":11},""]
[{"$nulls":11},""]
[{"$nulls":11},""]
[{"$nulls":11},""]
[{"$nulls":11},""]
[{"$nulls":11},""]
[{"$nulls":11},""]
[{"$nulls":11},""]
[{"$nulls":11},""]
[{"$nulls":11},""]
[{"$nulls":11},""]
[{"$nulls":11},""]
[{"$nulls":11},""]
[{"$nulls":11},""]
[{"$nulls":11},""]
[{"$nulls":11},""]
[{"$nulls":11},""]
[{"$nulls":11},""]
[{"$nulls":11},""]
[{"$nulls":11},""]
[{"$nulls":11},""]
[{"$nulls":11},""]
[{"$nulls":11},""]
[{"$nulls":11},""]
[{"$nulls":11},""]
[{"$nulls":11},""]
[{"$nulls":11},""]
[{"$nulls":11},""]
[{"$nulls":11},""]
[{"$nulls":11},""]
[{"$nulls":11},""]
[{"$nulls":11},""]
[{"$nulls":11},""]
[{"$nulls":11},""]
[{"$nulls":11},""]
[{"$nulls":11},""]
[{"$nulls":11},""]
[{"$nulls":11},{"$f":"IF(J3289=\"\",\"\",IF(J3289=\"NHVcz\",\"Btu/scf\",IF(J3289=\"NHVdil\",\"Btu/sq ft\",\"\")))","v":""}]
[{"$nulls":11},""]
[{"$nulls":11},""]
[{"$nulls":11},""]
[{"$nulls":11},""]
[{"$nulls":11},""]
[{"$nulls":11},""]
[{"$nulls":11},""]
[{"$nulls":11},""]
[{"$nulls":11},""]
[{"$nulls":11},""]
[{"$nulls":11},""]
[{"$nulls":11},""]
[{"$nulls":11},""]
[{"$nulls":11},""]
[{"$nulls":11},""]
[{"$nulls":11},""]
[{"$nulls":11},""]
[{"$nulls":11},""]
[{"$nulls":11},""]
[{"$nulls":11},""]
[{"$nulls":11},""]
[{"$nulls":11},""]
[{"$nulls":11},""]
[{"$nulls":11},""]
[{"$nulls":11},""]
[{"$nulls":11},""]
[{"$nulls":11},""]
[{"$nulls":11},""]
[{"$nulls":11},""]
[{"$nulls":11},""]
[{"$nulls":11},""]
[{"$nulls":11},""]
[{"$nulls":11},""]
[{"$nulls":11},""]
[{"$nulls":11},""]
[{"$nulls":11},""]
[{"$nulls":11},""]
[{"$nulls":11},""]
[{"$nulls":11},""]
[{"$nulls":11},""]
[{"$nulls":11},""]
[{"$nulls":11},""]
[{"$nulls":11},""]
[{"$nulls":11},""]
[{"$nulls":11},""]
[{"$nulls":11},""]
[{"$nulls":11},""]
[{"$nulls":11},""]
[{"$nulls":11},""]
[{"$nulls":11},""]
[{"$nulls":11},""]
[{"$nulls":11},""]
[{"$nulls":11},""]
[{"$nulls":11},""]
[{"$nulls":11},""]
[{"$nulls":11},""]
[{"$nulls":11},""]
[{"$nulls":11},""]
[{"$nulls":11},""]
[{"$nulls":11},""]
[{"$nulls":11},""]
[{"$nulls":11},""]
[{"$nulls":11},""]
[{"$nulls":11},{"$f":"IF(J3353=\"\",\"\",IF(J3353=\"NHVcz\",\"Btu/scf\",IF(J3353=\"NHVdil\",\"Btu/sq ft\",\"\")))","v":""}]
[{"$nulls":11},""]
[{"$nulls":11},""]
[{"$nulls":11},""]
[{"$nulls":11},""]
[{"$nulls":11},""]
[{"$nulls":11},""]
[{"$nulls":11},""]
[{"$nulls":11},""]
[{"$nulls":11},""]
[{"$nulls":11},""]
[{"$nulls":11},""]
[{"$nulls":11},""]
[{"$nulls":11},""]
[{"$nulls":11},""]
[{"$nulls":11},""]
[{"$nulls":11},""]
[{"$nulls":11},""]
[{"$nulls":11},""]
[{"$nulls":11},""]
[{"$nulls":11},""]
[{"$nulls":11},""]
[{"$nulls":11},""]
[{"$nulls":11},""]
[{"$nulls":11},""]
[{"$nulls":11},""]
[{"$nulls":11},""]
[{"$nulls":11},""]
[{"$nulls":11},""]
[{"$nulls":11},""]
[{"$nulls":11},""]
[{"$nulls":11},""]
[{"$nulls":11},""]
[{"$nulls":11},""]
[{"$nulls":11},""]
[{"$nulls":11},""]
[{"$nulls":11},""]
[{"$nulls":11},""]
[{"$nulls":11},""]
[{"$nulls":11},""]
[{"$nulls":11},""]
[{"$nulls":11},""]
[{"$nulls":11},""]
[{"$nulls":11},""]
[{"$nulls":11},""]
[{"$nulls":11},""]
[{"$nulls":11},""]
[{"$nulls":11},""]
[{"$nulls":11},""]
[{"$nulls":11},""]
[{"$nulls":11},""]
[{"$nulls":11},""]
[{"$nulls":11},""]
[{"$nulls":11},""]
[{"$nulls":11},""]
[{"$nulls":11},""]
[{"$nulls":11},""]
[{"$nulls":11},""]
[{"$nulls":11},""]
[{"$nulls":11},""]
[{"$nulls":11},""]
[{"$nulls":11},""]
[{"$nulls":11},""]
[{"$nulls":11},""]
[{"$nulls":11},{"$f":"IF(J3417=\"\",\"\",IF(J3417=\"NHVcz\",\"Btu/scf\",IF(J3417=\"NHVdil\",\"Btu/sq ft\",\"\")))","v":""}]
[{"$nulls":11},""]
[{"$nulls":11},""]
[{"$nulls":11},""]
[{"$nulls":11},""]
[{"$nulls":11},""]
[{"$nulls":11},""]
[{"$nulls":11},""]
[{"$nulls":11},""]
[{"$nulls":11},""]
[{"$nulls":11},""]
[{"$nulls":11},""]
[{"$nulls":11},""]
[{"$nulls":11},""]
[{"$nulls":11},""]
[{"$nulls":11},""]
[{"$nulls":11},""]
[{"$nulls":11},""]
[{"$nulls":11},""]
[{"$nulls":11},""]
[{"$nulls":11},""]
[{"$nulls":11},""]
[{"$nulls":11},""]
[{"$nulls":11},""]
[{"$nulls":11},""]
[{"$nulls":11},""]
[{"$nulls":11},""]
[{"$nulls":11},""]
[{"$nulls":11},""]
[{"$nulls":11},""]
[{"$nulls":11},""]
[{"$nulls":11},""]
[{"$nulls":11},""]
[{"$nulls":11},""]
[{"$nulls":11},""]
[{"$nulls":11},""]
[{"$nulls":11},""]
[{"$nulls":11},""]
[{"$nulls":11},""]
[{"$nulls":11},""]
[{"$nulls":11},""]
[{"$nulls":11},""]
[{"$nulls":11},""]
[{"$nulls":11},""]
[{"$nulls":11},""]
[{"$nulls":11},""]
[{"$nulls":11},""]
[{"$nulls":11},""]
[{"$nulls":11},""]
[{"$nulls":11},""]
[{"$nulls":11},""]
[{"$nulls":11},""]
[{"$nulls":11},""]
[{"$nulls":11},""]
[{"$nulls":11},""]
[{"$nulls":11},""]
[{"$nulls":11},""]
[{"$nulls":11},""]
[{"$nulls":11},""]
[{"$nulls":11},""]
[{"$nulls":11},""]
[{"$nulls":11},""]
[{"$nulls":11},""]
[{"$nulls":11},""]
[{"$nulls":11},{"$f":"IF(J3481=\"\",\"\",IF(J3481=\"NHVcz\",\"Btu/scf\",IF(J3481=\"NHVdil\",\"Btu/sq ft\",\"\")))","v":""}]
[{"$nulls":11},""]
[{"$nulls":11},""]
[{"$nulls":11},""]
[{"$nulls":11},""]
[{"$nulls":11},""]
[{"$nulls":11},""]
[{"$nulls":11},""]
[{"$nulls":11},""]
[{"$nulls":11},""]
[{"$nulls":11},""]
[{"$nulls":11},""]
[{"$nulls":11},""]
[{"$nulls":11},""]
[{"$nulls":11},""]
[{"$nulls":11},""]
[{"$nulls":11},""]
[{"$nulls":11},""]
[{"$nulls":11},""]
[{"$nulls":11},""]
[{"$nulls":11},""]
[{"$nulls":11},""]
[{"$nulls":11},""]
[{"$nulls":11},""]
[{"$nulls":11},""]
[{"$nulls":11},""]
[{"$nulls":11},""]
[{"$nulls":11},""]
[{"$nulls":11},""]
[{"$nulls":11},""]
[{"$nulls":11},""]
[{"$nulls":11},""]
[{"$nulls":11},""]
[{"$nulls":11},""]
[{"$nulls":11},""]
[{"$nulls":11},""]
[{"$nulls":11},""]
[{"$nulls":11},""]
[{"$nulls":11},""]
[{"$nulls":11},""]
[{"$nulls":11},""]
[{"$nulls":11},""]
[{"$nulls":11},""]
[{"$nulls":11},""]
[{"$nulls":11},""]
[{"$nulls":11},""]
[{"$nulls":11},""]
[{"$nulls":11},""]
[{"$nulls":11},""]
[{"$nulls":11},""]
[{"$nulls":11},""]
[{"$nulls":11},""]
[{"$nulls":11},""]
[{"$nulls":11},""]
[{"$nulls":11},""]
[{"$nulls":11},""]
[{"$nulls":11},""]
[{"$nulls":11},""]
[{"$nulls":11},""]
[{"$nulls":11},""]
[{"$nulls":11},""]
[{"$nulls":11},""]
[{"$nulls":11},""]
[{"$nulls":11},""]
[{"$nulls":11},{"$f":"IF(J3545=\"\",\"\",IF(J3545=\"NHVcz\",\"Btu/scf\",IF(J3545=\"NHVdil\",\"Btu/sq ft\",\"\")))","v":""}]
[{"$nulls":11},""]
[{"$nulls":11},""]
[{"$nulls":11},""]
[{"$nulls":11},""]
[{"$nulls":11},""]
[{"$nulls":11},""]
[{"$nulls":11},""]
[{"$nulls":11},""]
[{"$nulls":11},""]
[{"$nulls":11},""]
[{"$nulls":11},""]
[{"$nulls":11},""]
[{"$nulls":11},""]
[{"$nulls":11},""]
[{"$nulls":11},""]
[{"$nulls":11},""]
[{"$nulls":11},""]
[{"$nulls":11},""]
[{"$nulls":11},""]
[{"$nulls":11},""]
[{"$nulls":11},""]
[{"$nulls":11},""]
[{"$nulls":11},""]
[{"$nulls":11},""]
[{"$nulls":11},""]
[{"$nulls":11},""]
[{"$nulls":11},""]
[{"$nulls":11},""]
[{"$nulls":11},""]
[{"$nulls":11},""]
[{"$nulls":11},""]
[{"$nulls":11},""]
[{"$nulls":11},""]
[{"$nulls":11},""]
[{"$nulls":11},""]
[{"$nulls":11},""]
[{"$nulls":11},""]
[{"$nulls":11},""]
[{"$nulls":11},""]
[{"$nulls":11},""]
[{"$nulls":11},""]
[{"$nulls":11},""]
[{"$nulls":11},""]
[{"$nulls":11},""]
[{"$nulls":11},""]
[{"$nulls":11},""]
[{"$nulls":11},""]
[{"$nulls":11},""]
[{"$nulls":11},""]
[{"$nulls":11},""]
[{"$nulls":11},""]
[{"$nulls":11},""]
[{"$nulls":11},""]
[{"$nulls":11},""]
[{"$nulls":11},""]
[{"$nulls":11},""]
[{"$nulls":11},""]
[{"$nulls":11},""]
[{"$nulls":11},""]
[{"$nulls":11},""]
[{"$nulls":11},""]
[{"$nulls":11},""]
[{"$nulls":11},""]
[{"$nulls":11},{"$f":"IF(J3609=\"\",\"\",IF(J3609=\"NHVcz\",\"Btu/scf\",IF(J3609=\"NHVdil\",\"Btu/sq ft\",\"\")))","v":""}]
[{"$nulls":11},""]
[{"$nulls":11},""]
[{"$nulls":11},""]
[{"$nulls":11},""]
[{"$nulls":11},""]
[{"$nulls":11},""]
[{"$nulls":11},""]
[{"$nulls":11},""]
[{"$nulls":11},""]
[{"$nulls":11},""]
[{"$nulls":11},""]
[{"$nulls":11},""]
[{"$nulls":11},""]
[{"$nulls":11},""]
[{"$nulls":11},""]
[{"$nulls":11},""]
[{"$nulls":11},""]
[{"$nulls":11},""]
[{"$nulls":11},""]
[{"$nulls":11},""]
[{"$nulls":11},""]
[{"$nulls":11},""]
[{"$nulls":11},""]
[{"$nulls":11},""]
[{"$nulls":11},""]
[{"$nulls":11},""]
[{"$nulls":11},""]
[{"$nulls":11},""]
[{"$nulls":11},""]
[{"$nulls":11},""]
[{"$nulls":11},""]
[{"$nulls":11},""]
[{"$nulls":11},""]
[{"$nulls":11},""]
[{"$nulls":11},""]
[{"$nulls":11},""]
[{"$nulls":11},""]
[{"$nulls":11},""]
[{"$nulls":11},""]
[{"$nulls":11},""]
[{"$nulls":11},""]
[{"$nulls":11},""]
[{"$nulls":11},""]
[{"$nulls":11},""]
[{"$nulls":11},""]
[{"$nulls":11},""]
[{"$nulls":11},""]
[{"$nulls":11},""]
[{"$nulls":11},""]
[{"$nulls":11},""]
[{"$nulls":11},""]
[{"$nulls":11},""]
[{"$nulls":11},""]
[{"$nulls":11},""]
[{"$nulls":11},""]
[{"$nulls":11},""]
[{"$nulls":11},""]
[{"$nulls":11},""]
[{"$nulls":11},""]
[{"$nulls":11},""]
[{"$nulls":11},""]
[{"$nulls":11},""]
[{"$nulls":11},""]
[{"$nulls":11},{"$f":"IF(J3673=\"\",\"\",IF(J3673=\"NHVcz\",\"Btu/scf\",IF(J3673=\"NHVdil\",\"Btu/sq ft\",\"\")))","v":""}]
[{"$nulls":11},""]
[{"$nulls":11},""]
[{"$nulls":11},""]
[{"$nulls":11},""]
[{"$nulls":11},""]
[{"$nulls":11},""]
[{"$nulls":11},""]
[{"$nulls":11},""]
[{"$nulls":11},""]
[{"$nulls":11},""]
[{"$nulls":11},""]
[{"$nulls":11},""]
[{"$nulls":11},""]
[{"$nulls":11},""]
[{"$nulls":11},""]
[{"$nulls":11},""]
[{"$nulls":11},""]
[{"$nulls":11},""]
[{"$nulls":11},""]
[{"$nulls":11},""]
[{"$nulls":11},""]
[{"$nulls":11},""]
[{"$nulls":11},""]
[{"$nulls":11},""]
[{"$nulls":11},""]
[{"$nulls":11},""]
[{"$nulls":11},""]
[{"$nulls":11},""]
[{"$nulls":11},""]
[{"$nulls":11},""]
[{"$nulls":11},""]
[{"$nulls":11},""]
[{"$nulls":11},""]
[{"$nulls":11},""]
[{"$nulls":11},""]
[{"$nulls":11},""]
[{"$nulls":11},""]
[{"$nulls":11},""]
[{"$nulls":11},""]
[{"$nulls":11},""]
[{"$nulls":11},""]
[{"$nulls":11},""]
[{"$nulls":11},""]
[{"$nulls":11},""]
[{"$nulls":11},""]
[{"$nulls":11},""]
[{"$nulls":11},""]
[{"$nulls":11},""]
[{"$nulls":11},""]
[{"$nulls":11},""]
[{"$nulls":11},""]
[{"$nulls":11},""]
[{"$nulls":11},""]
[{"$nulls":11},""]
[{"$nulls":11},""]
[{"$nulls":11},""]
[{"$nulls":11},""]
[{"$nulls":11},""]
[{"$nulls":11},""]
[{"$nulls":11},""]
[{"$nulls":11},""]
[{"$nulls":11},""]
[{"$nulls":11},""]
[{"$nulls":11},{"$f":"IF(J3737=\"\",\"\",IF(J3737=\"NHVcz\",\"Btu/scf\",IF(J3737=\"NHVdil\",\"Btu/sq ft\",\"\")))","v":""}]
[{"$nulls":11},""]
[{"$nulls":11},""]
[{"$nulls":11},""]
[{"$nulls":11},""]
[{"$nulls":11},""]
[{"$nulls":11},""]
[{"$nulls":11},""]
[{"$nulls":11},""]
[{"$nulls":11},""]
[{"$nulls":11},""]
[{"$nulls":11},""]
[{"$nulls":11},""]
[{"$nulls":11},""]
[{"$nulls":11},""]
[{"$nulls":11},""]
[{"$nulls":11},""]
[{"$nulls":11},""]
[{"$nulls":11},""]
[{"$nulls":11},""]
[{"$nulls":11},""]
[{"$nulls":11},""]
[{"$nulls":11},""]
[{"$nulls":11},""]
[{"$nulls":11},""]
[{"$nulls":11},""]
[{"$nulls":11},""]
[{"$nulls":11},""]
[{"$nulls":11},""]
[{"$nulls":11},""]
[{"$nulls":11},""]
[{"$nulls":11},""]
[{"$nulls":11},""]
[{"$nulls":11},""]
[{"$nulls":11},""]
[{"$nulls":11},""]
[{"$nulls":11},""]
[{"$nulls":11},""]
[{"$nulls":11},""]
[{"$nulls":11},""]
[{"$nulls":11},""]
[{"$nulls":11},""]
[{"$nulls":11},""]
[{"$nulls":11},""]
[{"$nulls":11},""]
[{"$nulls":11},""]
[{"$nulls":11},""]
[{"$nulls":11},""]
[{"$nulls":11},""]
[{"$nulls":11},""]
[{"$nulls":11},""]
[{"$nulls":11},""]
[{"$nulls":11},""]
[{"$nulls":11},""]
[{"$nulls":11},""]
[{"$nulls":11},""]
[{"$nulls":11},""]
[{"$nulls":11},""]
[{"$nulls":11},""]
[{"$nulls":11},""]
[{"$nulls":11},""]
[{"$nulls":11},""]
[{"$nulls":11},""]
[{"$nulls":11},""]
[{"$nulls":11},{"$f":"IF(J3801=\"\",\"\",IF(J3801=\"NHVcz\",\"Btu/scf\",IF(J3801=\"NHVdil\",\"Btu/sq ft\",\"\")))","v":""}]
[{"$nulls":11},""]
[{"$nulls":11},""]
[{"$nulls":11},""]
[{"$nulls":11},""]
[{"$nulls":11},""]
[{"$nulls":11},""]
[{"$nulls":11},""]
[{"$nulls":11},""]
[{"$nulls":11},""]
[{"$nulls":11},""]
[{"$nulls":11},""]
[{"$nulls":11},""]
[{"$nulls":11},""]
[{"$nulls":11},""]
[{"$nulls":11},""]
[{"$nulls":11},""]
[{"$nulls":11},""]
[{"$nulls":11},""]
[{"$nulls":11},""]
[{"$nulls":11},""]
[{"$nulls":11},""]
[{"$nulls":11},""]
[{"$nulls":11},""]
[{"$nulls":11},""]
[{"$nulls":11},""]
[{"$nulls":11},""]
[{"$nulls":11},""]
[{"$nulls":11},""]
[{"$nulls":11},""]
[{"$nulls":11},""]
[{"$nulls":11},""]
[{"$nulls":11},""]
[{"$nulls":11},""]
[{"$nulls":11},""]
[{"$nulls":11},""]
[{"$nulls":11},""]
[{"$nulls":11},""]
[{"$nulls":11},""]
[{"$nulls":11},""]
[{"$nulls":11},""]
[{"$nulls":11},""]
[{"$nulls":11},""]
[{"$nulls":11},""]
[{"$nulls":11},""]
[{"$nulls":11},""]
[{"$nulls":11},""]
[{"$nulls":11},""]
[{"$nulls":11},""]
[{"$nulls":11},""]
[{"$nulls":11},""]
[{"$nulls":11},""]
[{"$nulls":11},""]
[{"$nulls":11},""]
[{"$nulls":11},""]
[{"$nulls":11},""]
[{"$nulls":11},""]
[{"$nulls":11},""]
[{"$nulls":11},""]
[{"$nulls":11},""]
[{"$nulls":11},""]
[{"$nulls":11},""]
[{"$nulls":11},""]
[{"$nulls":11},""]
[{"$nulls":11},{"$f":"IF(J3865=\"\",\"\",IF(J3865=\"NHVcz\",\"Btu/scf\",IF(J3865=\"NHVdil\",\"Btu/sq ft\",\"\")))","v":""}]
[{"$nulls":11},""]
[{"$nulls":11},""]
[{"$nulls":11},""]
[{"$nulls":11},""]
[{"$nulls":11},""]
[{"$nulls":11},""]
[{"$nulls":11},""]
[{"$nulls":11},""]
[{"$nulls":11},""]
[{"$nulls":11},""]
[{"$nulls":11},""]
[{"$nulls":11},""]
[{"$nulls":11},""]
[{"$nulls":11},""]
[{"$nulls":11},""]
[{"$nulls":11},""]
[{"$nulls":11},""]
[{"$nulls":11},""]
[{"$nulls":11},""]
[{"$nulls":11},""]
[{"$nulls":11},""]
[{"$nulls":11},""]
[{"$nulls":11},""]
[{"$nulls":11},""]
[{"$nulls":11},""]
[{"$nulls":11},""]
[{"$nulls":11},""]
[{"$nulls":11},""]
[{"$nulls":11},""]
[{"$nulls":11},""]
[{"$nulls":11},""]
[{"$nulls":11},""]
[{"$nulls":11},""]
[{"$nulls":11},""]
[{"$nulls":11},""]
[{"$nulls":11},""]
[{"$nulls":11},""]
[{"$nulls":11},""]
[{"$nulls":11},""]
[{"$nulls":11},""]
[{"$nulls":11},""]
[{"$nulls":11},""]
[{"$nulls":11},""]
[{"$nulls":11},""]
[{"$nulls":11},""]
[{"$nulls":11},""]
[{"$nulls":11},""]
[{"$nulls":11},""]
[{"$nulls":11},""]
[{"$nulls":11},""]
[{"$nulls":11},""]
[{"$nulls":11},""]
[{"$nulls":11},""]
[{"$nulls":11},""]
[{"$nulls":11},""]
[{"$nulls":11},""]
[{"$nulls":11},""]
[{"$nulls":11},""]
[{"$nulls":11},""]
[{"$nulls":11},""]
[{"$nulls":11},""]
[{"$nulls":11},""]
[{"$nulls":11},""]
[{"$nulls":11},{"$f":"IF(J3929=\"\",\"\",IF(J3929=\"NHVcz\",\"Btu/scf\",IF(J3929=\"NHVdil\",\"Btu/sq ft\",\"\")))","v":""}]
[{"$nulls":11},""]
[{"$nulls":11},""]
[{"$nulls":11},""]
[{"$nulls":11},""]
[{"$nulls":11},""]
[{"$nulls":11},""]
[{"$nulls":11},""]
[{"$nulls":11},""]
[{"$nulls":11},""]
[{"$nulls":11},""]
[{"$nulls":11},""]
[{"$nulls":11},""]
[{"$nulls":11},""]
[{"$nulls":11},""]
[{"$nulls":11},""]
[{"$nulls":11},""]
[{"$nulls":11},""]
[{"$nulls":11},""]
[{"$nulls":11},""]
[{"$nulls":11},""]
[{"$nulls":11},""]
[{"$nulls":11},""]
[{"$nulls":11},""]
[{"$nulls":11},""]
[{"$nulls":11},""]
[{"$nulls":11},""]
[{"$nulls":11},""]
[{"$nulls":11},""]
[{"$nulls":11},""]
[{"$nulls":11},""]
[{"$nulls":11},""]
[{"$nulls":11},""]
[{"$nulls":11},""]
[{"$nulls":11},""]
[{"$nulls":11},""]
[{"$nulls":11},""]
[{"$nulls":11},""]
[{"$nulls":11},""]
[{"$nulls":11},""]
[{"$nulls":11},""]
[{"$nulls":11},""]
[{"$nulls":11},""]
[{"$nulls":11},""]
[{"$nulls":11},""]
[{"$nulls":11},""]
[{"$nulls":11},""]
[{"$nulls":11},""]
[{"$nulls":11},""]
[{"$nulls":11},""]
[{"$nulls":11},""]
[{"$nulls":11},""]
[{"$nulls":11},""]
[{"$nulls":11},""]
[{"$nulls":11},""]
[{"$nulls":11},""]
[{"$nulls":11},""]
[{"$nulls":11},""]
[{"$nulls":11},""]
[{"$nulls":11},""]
[{"$nulls":11},""]
[{"$nulls":11},""]
[{"$nulls":11},""]
[{"$nulls":11},""]
[{"$nulls":11},{"$f":"IF(J3993=\"\",\"\",IF(J3993=\"NHVcz\",\"Btu/scf\",IF(J3993=\"NHVdil\",\"Btu/sq ft\",\"\")))","v":""}]
[{"$nulls":11},""]
[{"$nulls":11},""]
[{"$nulls":11},""]
[{"$nulls":11},""]
[{"$nulls":11},""]
[{"$nulls":11},""]
[{"$nulls":11},""]
[{"$nulls":11},""]
[{"$nulls":11},""]
[{"$nulls":11},""]
[{"$nulls":11},""]
[{"$nulls":11},""]
[{"$nulls":11},""]
[{"$nulls":11},""]
[{"$nulls":11},""]
[{"$nulls":11},""]
[{"$nulls":11},""]
[{"$nulls":11},""]
[{"$nulls":11},""]
[{"$nulls":11},""]
[{"$nulls":11},""]
[{"$nulls":11},""]
[{"$nulls":11},""]
[{"$nulls":11},""]
[{"$nulls":11},""]
[{"$nulls":11},""]
[{"$nulls":11},""]
[{"$nulls":11},""]
[{"$nulls":11},""]
[{"$nulls":11},""]
[{"$nulls":11},""]
[{"$nulls":11},""]
[{"$nulls":11},""]
[{"$nulls":11},""]
[{"$nulls":11},""]
[{"$nulls":11},""]
[{"$nulls":11},""]
[{"$nulls":11},""]
[{"$nulls":11},""]
[{"$nulls":11},""]
[{"$nulls":11},""]
[{"$nulls":11},""]
[{"$nulls":11},""]
[{"$nulls":11},""]
[{"$nulls":11},""]
[{"$nulls":11},""]
[{"$nulls":11},""]
[{"$nulls":11},""]
[{"$nulls":11},""]
[{"$nulls":11},""]
[{"$nulls":11},""]
[{"$nulls":11},""]
[{"$nulls":11},""]
[{"$nulls":11},""]
[{"$nulls":11},""]
[{"$nulls":11},""]
[{"$nulls":11},""]
[{"$nulls":11},""]
[{"$nulls":11},""]
[{"$nulls":11},""]
[{"$nulls":11},""]
[{"$nulls":11},""]
[{"$nulls":11},""]
[{"$nulls":11},{"$f":"IF(J4057=\"\",\"\",IF(J4057=\"NHVcz\",\"Btu/scf\",IF(J4057=\"NHVdil\",\"Btu/sq ft\",\"\")))","v":""}]
[{"$nulls":11},""]
[{"$nulls":11},""]
[{"$nulls":11},""]
[{"$nulls":11},""]
[{"$nulls":11},""]
[{"$nulls":11},""]
[{"$nulls":11},""]
[{"$nulls":11},""]
[{"$nulls":11},""]
[{"$nulls":11},""]
[{"$nulls":11},""]
[{"$nulls":11},""]
[{"$nulls":11},""]
[{"$nulls":11},""]
[{"$nulls":11},""]
[{"$nulls":11},""]
[{"$nulls":11},""]
[{"$nulls":11},""]
[{"$nulls":11},""]
[{"$nulls":11},""]
[{"$nulls":11},""]
[{"$nulls":11},""]
[{"$nulls":11},""]
[{"$nulls":11},""]
[{"$nulls":11},""]
[{"$nulls":11},""]
[{"$nulls":11},""]
[{"$nulls":11},""]
[{"$nulls":11},""]
[{"$nulls":11},""]
[{"$nulls":11},""]
[{"$nulls":11},""]
[{"$nulls":11},""]
[{"$nulls":11},""]
[{"$nulls":11},""]
[{"$nulls":11},""]
[{"$nulls":11},""]
[{"$nulls":11},""]
[{"$nulls":11},""]
[{"$nulls":11},""]
[{"$nulls":11},""]
[{"$nulls":11},""]
[{"$nulls":11},""]
[{"$nulls":11},""]
[{"$nulls":11},""]
[{"$nulls":11},""]
[{"$nulls":11},""]
[{"$nulls":11},""]
[{"$nulls":11},""]
[{"$nulls":11},""]
[{"$nulls":11},""]
[{"$nulls":11},""]
[{"$nulls":11},""]
[{"$nulls":11},""]
[{"$nulls":11},""]
[{"$nulls":11},""]
[{"$nulls":11},""]
[{"$nulls":11},""]
[{"$nulls":11},""]
[{"$nulls":11},""]
[{"$nulls":11},""]
[{"$nulls":11},""]
[{"$nulls":11},""]
[{"$nulls":11},{"$f":"IF(J4121=\"\",\"\",IF(J4121=\"NHVcz\",\"Btu/scf\",IF(J4121=\"NHVdil\",\"Btu/sq ft\",\"\")))","v":""}]
[{"$nulls":11},""]
[{"$nulls":11},""]
[{"$nulls":11},""]
[{"$nulls":11},""]
[{"$nulls":11},""]
[{"$nulls":11},""]
[{"$nulls":11},""]
[{"$nulls":11},""]
[{"$nulls":11},""]
[{"$nulls":11},""]
[{"$nulls":11},""]
[{"$nulls":11},""]
[{"$nulls":11},""]
[{"$nulls":11},""]
[{"$nulls":11},""]
[{"$nulls":11},""]
[{"$nulls":11},""]
[{"$nulls":11},""]
[{"$nulls":11},""]
[{"$nulls":11},""]
[{"$nulls":11},""]
[{"$nulls":11},""]
[{"$nulls":11},""]
[{"$nulls":11},""]
[{"$nulls":11},""]
[{"$nulls":11},""]
[{"$nulls":11},""]
[{"$nulls":11},""]
[{"$nulls":11},""]
[{"$nulls":11},""]
[{"$nulls":11},""]
[{"$nulls":11},""]
[{"$nulls":11},""]
[{"$nulls":11},""]
[{"$nulls":11},""]
[{"$nulls":11},""]
[{"$nulls":11},""]
[{"$nulls":11},""]
[{"$nulls":11},""]
[{"$nulls":11},""]
[{"$nulls":11},""]
[{"$nulls":11},""]
[{"$nulls":11},""]
[{"$nulls":11},""]
[{"$nulls":11},""]
[{"$nulls":11},""]
[{"$nulls":11},""]
[{"$nulls":11},""]
[{"$nulls":11},""]
[{"$nulls":11},""]
[{"$nulls":11},""]
[{"$nulls":11},""]
[{"$nulls":11},""]
[{"$nulls":11},""]
[{"$nulls":11},""]
[{"$nulls":11},""]
[{"$nulls":11},""]
[{"$nulls":11},""]
[{"$nulls":11},""]
[{"$nulls":11},""]
[{"$nulls":11},""]
[{"$nulls":11},""]
[{"$nulls":11},""]
[{"$nulls":11},{"$f":"IF(J4185=\"\",\"\",IF(J4185=\"NHVcz\",\"Btu/scf\",IF(J4185=\"NHVdil\",\"Btu/sq ft\",\"\")))","v":""}]
[{"$nulls":11},""]
[{"$nulls":11},""]
[{"$nulls":11},""]
[{"$nulls":11},""]
[{"$nulls":11},""]
[{"$nulls":11},""]
[{"$nulls":11},""]
[{"$nulls":11},""]
[{"$nulls":11},""]
[{"$nulls":11},""]
[{"$nulls":11},""]
[{"$nulls":11},""]
[{"$nulls":11},""]
[{"$nulls":11},""]
[{"$nulls":11},""]
[{"$nulls":11},""]
[{"$nulls":11},""]
[{"$nulls":11},""]
[{"$nulls":11},""]
[{"$nulls":11},""]
[{"$nulls":11},""]
[{"$nulls":11},""]
[{"$nulls":11},""]
[{"$nulls":11},""]
[{"$nulls":11},""]
[{"$nulls":11},""]
[{"$nulls":11},""]
[{"$nulls":11},""]
[{"$nulls":11},""]
[{"$nulls":11},""]
[{"$nulls":11},""]
[{"$nulls":11},""]
[{"$nulls":11},""]
[{"$nulls":11},""]
[{"$nulls":11},""]
[{"$nulls":11},""]
[{"$nulls":11},""]
[{"$nulls":11},""]
[{"$nulls":11},""]
[{"$nulls":11},""]
[{"$nulls":11},""]
[{"$nulls":11},""]
[{"$nulls":11},""]
[{"$nulls":11},""]
[{"$nulls":11},""]
[{"$nulls":11},""]
[{"$nulls":11},""]
[{"$nulls":11},""]
[{"$nulls":11},""]
[{"$nulls":11},""]
[{"$nulls":11},""]
[{"$nulls":11},""]
[{"$nulls":11},""]
[{"$nulls":11},""]
[{"$nulls":11},""]
[{"$nulls":11},""]
[{"$nulls":11},""]
[{"$nulls":11},""]
[{"$nulls":11},""]
[{"$nulls":11},""]
[{"$nulls":11},""]
[{"$nulls":11},""]
[{"$nulls":11},""]
[{"$nulls":11},{"$f":"IF(J4249=\"\",\"\",IF(J4249=\"NHVcz\",\"Btu/scf\",IF(J4249=\"NHVdil\",\"Btu/sq ft\",\"\")))","v":""}]
[{"$nulls":11},""]
[{"$nulls":11},""]
[{"$nulls":11},""]
[{"$nulls":11},""]
[{"$nulls":11},""]
[{"$nulls":11},""]
[{"$nulls":11},""]
[{"$nulls":11},""]
[{"$nulls":11},""]
[{"$nulls":11},""]
[{"$nulls":11},""]
[{"$nulls":11},""]
[{"$nulls":11},""]
[{"$nulls":11},""]
[{"$nulls":11},""]
[{"$nulls":11},""]
[{"$nulls":11},""]
[{"$nulls":11},""]
[{"$nulls":11},""]
[{"$nulls":11},""]
[{"$nulls":11},""]
[{"$nulls":11},""]
[{"$nulls":11},""]
[{"$nulls":11},""]
[{"$nulls":11},""]
[{"$nulls":11},""]
[{"$nulls":11},""]
[{"$nulls":11},""]
[{"$nulls":11},""]
[{"$nulls":11},""]
[{"$nulls":11},""]
[{"$nulls":11},""]
[{"$nulls":11},""]
[{"$nulls":11},""]
[{"$nulls":11},""]
[{"$nulls":11},""]
[{"$nulls":11},""]
[{"$nulls":11},""]
[{"$nulls":11},""]
[{"$nulls":11},""]
[{"$nulls":11},""]
[{"$nulls":11},""]
[{"$nulls":11},""]
[{"$nulls":11},""]
[{"$nulls":11},""]
[{"$nulls":11},""]
[{"$nulls":11},""]
[{"$nulls":11},""]
[{"$nulls":11},""]
[{"$nulls":11},""]
[{"$nulls":11},""]
[{"$nulls":11},""]
[{"$nulls":11},""]
[{"$nulls":11},""]
[{"$nulls":11},""]
[{"$nulls":11},""]
[{"$nulls":11},""]
[{"$nulls":11},""]
[{"$nulls":11},""]
[{"$nulls":11},""]
[{"$nulls":11},""]
[{"$nulls":11},""]
[{"$nulls":11},""]
[{"$nulls":11},{"$f":"IF(J4313=\"\",\"\",IF(J4313=\"NHVcz\",\"Btu/scf\",IF(J4313=\"NHVdil\",\"Btu/sq ft\",\"\")))","v":""}]
[{"$nulls":11},""]
[{"$nulls":11},""]
[{"$nulls":11},""]
[{"$nulls":11},""]
[{"$nulls":11},""]
[{"$nulls":11},""]
[{"$nulls":11},""]
[{"$nulls":11},""]
[{"$nulls":11},""]
[{"$nulls":11},""]
[{"$nulls":11},""]
[{"$nulls":11},""]
[{"$nulls":11},""]
[{"$nulls":11},""]
[{"$nulls":11},""]
[{"$nulls":11},""]
[{"$nulls":11},""]
[{"$nulls":11},""]
[{"$nulls":11},""]
[{"$nulls":11},""]
[{"$nulls":11},""]
[{"$nulls":11},""]
[{"$nulls":11},""]
[{"$nulls":11},""]
[{"$nulls":11},""]
[{"$nulls":11},""]
[{"$nulls":11},""]
[{"$nulls":11},""]
[{"$nulls":11},""]
[{"$nulls":11},""]
[{"$nulls":11},""]
[{"$nulls":11},""]
[{"$nulls":11},""]
[{"$nulls":11},""]
[{"$nulls":11},""]
[{"$nulls":11},""]
[{"$nulls":11},""]
[{"$nulls":11},""]
[{"$nulls":11},""]
[{"$nulls":11},""]
[{"$nulls":11},""]
[{"$nulls":11},""]
[{"$nulls":11},""]
[{"$nulls":11},""]
[{"$nulls":11},""]
[{"$nulls":11},""]
[{"$nulls":11},""]
[{"$nulls":11},""]
[{"$nulls":11},""]
[{"$nulls":11},""]
[{"$nulls":11},""]
[{"$nulls":11},""]
[{"$nulls":11},""]
[{"$nulls":11},""]
[{"$nulls":11},""]
[{"$nulls":11},""]
[{"$nulls":11},""]
[{"$nulls":11},""]
[{"$nulls":11},""]
[{"$nulls":11},""]
[{"$nulls":11},""]
[{"$nulls":11},""]
[{"$nulls":11},""]
[{"$nulls":11},{"$f":"IF(J4377=\"\",\"\",IF(J4377=\"NHVcz\",\"Btu/scf\",IF(J4377=\"NHVdil\",\"Btu/sq ft\",\"\")))","v":""}]
[{"$nulls":11},""]
[{"$nulls":11},""]
[{"$nulls":11},""]
[{"$nulls":11},""]
[{"$nulls":11},""]
[{"$nulls":11},""]
[{"$nulls":11},""]
[{"$nulls":11},""]
[{"$nulls":11},""]
[{"$nulls":11},""]
[{"$nulls":11},""]
[{"$nulls":11},""]
[{"$nulls":11},""]
[{"$nulls":11},""]
[{"$nulls":11},""]
[{"$nulls":11},""]
[{"$nulls":11},""]
[{"$nulls":11},""]
[{"$nulls":11},""]
[{"$nulls":11},""]
[{"$nulls":11},""]
[{"$nulls":11},""]
[{"$nulls":11},""]
[{"$nulls":11},""]
[{"$nulls":11},""]
[{"$nulls":11},""]
[{"$nulls":11},""]
[{"$nulls":11},""]
[{"$nulls":11},""]
[{"$nulls":11},""]
[{"$nulls":11},""]
[{"$nulls":11},""]
[{"$nulls":11},""]
[{"$nulls":11},""]
[{"$nulls":11},""]
[{"$nulls":11},""]
[{"$nulls":11},""]
[{"$nulls":11},""]
[{"$nulls":11},""]
[{"$nulls":11},""]
[{"$nulls":11},""]
[{"$nulls":11},""]
[{"$nulls":11},""]
[{"$nulls":11},""]
[{"$nulls":11},""]
[{"$nulls":11},""]
[{"$nulls":11},""]
[{"$nulls":11},""]
[{"$nulls":11},""]
[{"$nulls":11},""]
[{"$nulls":11},""]
[{"$nulls":11},""]
[{"$nulls":11},""]
[{"$nulls":11},""]
[{"$nulls":11},""]
[{"$nulls":11},""]
[{"$nulls":11},""]
[{"$nulls":11},""]
[{"$nulls":11},""]
[{"$nulls":11},""]
[{"$nulls":11},""]
[{"$nulls":11},""]
[{"$nulls":11},""]
[{"$nulls":11},{"$f":"IF(J4441=\"\",\"\",IF(J4441=\"NHVcz\",\"Btu/scf\",IF(J4441=\"NHVdil\",\"Btu/sq ft\",\"\")))","v":""}]
[{"$nulls":11},""]
[{"$nulls":11},""]
[{"$nulls":11},""]
[{"$nulls":11},""]
[{"$nulls":11},""]
[{"$nulls":11},""]
[{"$nulls":11},""]
[{"$nulls":11},""]
[{"$nulls":11},""]
[{"$nulls":11},""]
[{"$nulls":11},""]
[{"$nulls":11},""]
[{"$nulls":11},""]
[{"$nulls":11},""]
[{"$nulls":11},""]
[{"$nulls":11},""]
[{"$nulls":11},""]
[{"$nulls":11},""]
[{"$nulls":11},""]
[{"$nulls":11},""]
[{"$nulls":11},""]
[{"$nulls":11},""]
[{"$nulls":11},""]
[{"$nulls":11},""]
[{"$nulls":11},""]
[{"$nulls":11},""]
[{"$nulls":11},""]
[{"$nulls":11},""]
[{"$nulls":11},""]
[{"$nulls":11},""]
[{"$nulls":11},""]
[{"$nulls":11},""]
[{"$nulls":11},""]
[{"$nulls":11},""]
[{"$nulls":11},""]
[{"$nulls":11},""]
[{"$nulls":11},""]
[{"$nulls":11},""]
[{"$nulls":11},""]
[{"$nulls":11},""]
[{"$nulls":11},""]
[{"$nulls":11},""]
[{"$nulls":11},""]
[{"$nulls":11},""]
[{"$nulls":11},""]
[{"$nulls":11},""]
[{"$nulls":11},""]
[{"$nulls":11},""]
[{"$nulls":11},""]
[{"$nulls":11},""]
[{"$nulls":11},""]
[{"$nulls":11},""]
[{"$nulls":11},""]
[{"$nulls":11},""]
[{"$nulls":11},""]
[{"$nulls":11},""]
[{"$nulls":11},""]
[{"$nulls":11},""]
[{"$nulls":11},""]
[{"$nulls":11},""]
[{"$nulls":11},""]
[{"$nulls":11},""]
[{"$nulls":11},""]
[{"$nulls":11},{"$f":"IF(J4505=\"\",\"\",IF(J4505=\"NHVcz\",\"Btu/scf\",IF(J4505=\"NHVdil\",\"Btu/sq ft\",\"\")))","v":""}]
[{"$nulls":11},""]
[{"$nulls":11},""]
[{"$nulls":11},""]
[{"$nulls":11},""]
[{"$nulls":11},""]
[{"$nulls":11},""]
[{"$nulls":11},""]
[{"$nulls":11},""]
[{"$nulls":11},""]
[{"$nulls":11},""]
[{"$nulls":11},""]
[{"$nulls":11},""]
[{"$nulls":11},""]
[{"$nulls":11},""]
[{"$nulls":11},""]
[{"$nulls":11},""]
[{"$nulls":11},""]
[{"$nulls":11},""]
[{"$nulls":11},""]
[{"$nulls":11},""]
[{"$nulls":11},""]
[{"$nulls":11},""]
[{"$nulls":11},""]
[{"$nulls":11},""]
[{"$nulls":11},""]
[{"$nulls":11},""]
[{"$nulls":11},""]
[{"$nulls":11},""]
[{"$nulls":11},""]
[{"$nulls":11},""]
[{"$nulls":11},""]
[{"$nulls":11},""]
[{"$nulls":11},""]
[{"$nulls":11},""]
[{"$nulls":11},""]
[{"$nulls":11},""]
[{"$nulls":11},""]
[{"$nulls":11},""]
[{"$nulls":11},""]
[{"$nulls":11},""]
[{"$nulls":11},""]
[{"$nulls":11},""]
[{"$nulls":11},""]
[{"$nulls":11},""]
[{"$nulls":11},""]
[{"$nulls":11},""]
[{"$nulls":11},""]
[{"$nulls":11},""]
[{"$nulls":11},""]
[{"$nulls":11},""]
[{"$nulls":11},""]
[{"$nulls":11},""]
[{"$nulls":11},""]
[{"$nulls":11},""]
[{"$nulls":11},""]
[{"$nulls":11},""]
[{"$nulls":11},""]
[{"$nulls":11},""]
[{"$nulls":11},""]
[{"$nulls":11},""]
[{"$nulls":11},""]
[{"$nulls":11},""]
[{"$nulls":11},""]
[{"$nulls":11},{"$f":"IF(J4569=\"\",\"\",IF(J4569=\"NHVcz\",\"Btu/scf\",IF(J4569=\"NHVdil\",\"Btu/sq ft\",\"\")))","v":""}]
[{"$nulls":11},""]
[{"$nulls":11},""]
[{"$nulls":11},""]
[{"$nulls":11},""]
[{"$nulls":11},""]
[{"$nulls":11},""]
[{"$nulls":11},""]
[{"$nulls":11},""]
[{"$nulls":11},""]
[{"$nulls":11},""]
[{"$nulls":11},""]
[{"$nulls":11},""]
[{"$nulls":11},""]
[{"$nulls":11},""]
[{"$nulls":11},""]
[{"$nulls":11},""]
[{"$nulls":11},""]
[{"$nulls":11},""]
[{"$nulls":11},""]
[{"$nulls":11},""]
[{"$nulls":11},""]
[{"$nulls":11},""]
[{"$nulls":11},""]
[{"$nulls":11},""]
[{"$nulls":11},""]
[{"$nulls":11},""]
[{"$nulls":11},""]
[{"$nulls":11},""]
[{"$nulls":11},""]
[{"$nulls":11},""]
[{"$nulls":11},""]
[{"$nulls":11},""]
[{"$nulls":11},""]
[{"$nulls":11},""]
[{"$nulls":11},""]
[{"$nulls":11},""]
[{"$nulls":11},""]
[{"$nulls":11},""]
[{"$nulls":11},""]
[{"$nulls":11},""]
[{"$nulls":11},""]
[{"$nulls":11},""]
[{"$nulls":11},""]
[{"$nulls":11},""]
[{"$nulls":11},""]
[{"$nulls":11},""]
[{"$nulls":11},""]
[{"$nulls":11},""]
[{"$nulls":11},""]
[{"$nulls":11},""]
[{"$nulls":11},""]
[{"$nulls":11},""]
[{"$nulls":11},""]
[{"$nulls":11},""]
[{"$nulls":11},""]
[{"$nulls":11},""]
[{"$nulls":11},""]
[{"$nulls":11},""]
[{"$nulls":11},""]
[{"$nulls":11},""]
[{"$nulls":11},""]
[{"$nulls":11},""]
[{"$nulls":11},""]
[{"$nulls":11},{"$f":"IF(J4633=\"\",\"\",IF(J4633=\"NHVcz\",\"Btu/scf\",IF(J4633=\"NHVdil\",\"Btu/sq ft\",\"\")))","v":""}]
[{"$nulls":11},""]
[{"$nulls":11},""]
[{"$nulls":11},""]
[{"$nulls":11},""]
[{"$nulls":11},""]
[{"$nulls":11},""]
[{"$nulls":11},""]
[{"$nulls":11},""]
[{"$nulls":11},""]
[{"$nulls":11},""]
[{"$nulls":11},""]
[{"$nulls":11},""]
[{"$nulls":11},""]
[{"$nulls":11},""]
[{"$nulls":11},""]
[{"$nulls":11},""]
[{"$nulls":11},""]
[{"$nulls":11},""]
[{"$nulls":11},""]
[{"$nulls":11},""]
[{"$nulls":11},""]
[{"$nulls":11},""]
[{"$nulls":11},""]
[{"$nulls":11},""]
[{"$nulls":11},""]
[{"$nulls":11},""]
[{"$nulls":11},""]
[{"$nulls":11},""]
[{"$nulls":11},""]
[{"$nulls":11},""]
[{"$nulls":11},""]
[{"$nulls":11},""]
[{"$nulls":11},""]
[{"$nulls":11},""]
[{"$nulls":11},""]
[{"$nulls":11},""]
[{"$nulls":11},""]
[{"$nulls":11},""]
[{"$nulls":11},""]
[{"$nulls":11},""]
[{"$nulls":11},""]
[{"$nulls":11},""]
[{"$nulls":11},""]
[{"$nulls":11},""]
[{"$nulls":11},""]
[{"$nulls":11},""]
[{"$nulls":11},""]
[{"$nulls":11},""]
[{"$nulls":11},""]
[{"$nulls":11},""]
[{"$nulls":11},""]
[{"$nulls":11},""]
[{"$nulls":11},""]
[{"$nulls":11},""]
[{"$nulls":11},""]
[{"$nulls":11},""]
[{"$nulls":11},""]
[{"$nulls":11},""]
[{"$nulls":11},""]
[{"$nulls":11},""]
[{"$nulls":11},""]
[{"$nulls":11},""]
[{"$nulls":11},""]
[{"$nulls":11},{"$f":"IF(J4697=\"\",\"\",IF(J4697=\"NHVcz\",\"Btu/scf\",IF(J4697=\"NHVdil\",\"Btu/sq ft\",\"\")))","v":""}]
[{"$nulls":11},""]
[{"$nulls":11},""]
[{"$nulls":11},""]
[{"$nulls":11},""]
[{"$nulls":11},""]
[{"$nulls":11},""]
[{"$nulls":11},""]
[{"$nulls":11},""]
[{"$nulls":11},""]
[{"$nulls":11},""]
[{"$nulls":11},""]
[{"$nulls":11},""]
[{"$nulls":11},""]
[{"$nulls":11},""]
[{"$nulls":11},""]
[{"$nulls":11},""]
[{"$nulls":11},""]
[{"$nulls":11},""]
[{"$nulls":11},""]
[{"$nulls":11},""]
[{"$nulls":11},""]
[{"$nulls":11},""]
[{"$nulls":11},""]
[{"$nulls":11},""]
[{"$nulls":11},""]
[{"$nulls":11},""]
[{"$nulls":11},""]
[{"$nulls":11},""]
[{"$nulls":11},""]
[{"$nulls":11},""]
[{"$nulls":11},""]
[{"$nulls":11},""]
[{"$nulls":11},""]
[{"$nulls":11},""]
[{"$nulls":11},""]
[{"$nulls":11},""]
[{"$nulls":11},""]
[{"$nulls":11},""]
[{"$nulls":11},""]
[{"$nulls":11},""]
[{"$nulls":11},""]
[{"$nulls":11},""]
[{"$nulls":11},""]
[{"$nulls":11},""]
[{"$nulls":11},""]
[{"$nulls":11},""]
[{"$nulls":11},""]
[{"$nulls":11},""]
[{"$nulls":11},""]
[{"$nulls":11},""]
[{"$nulls":11},""]
[{"$nulls":11},""]
[{"$nulls":11},""]
[{"$nulls":11},""]
[{"$nulls":11},""]
[{"$nulls":11},""]
[{"$nulls":11},""]
[{"$nulls":11},""]
[{"$nulls":11},""]
[{"$nulls":11},""]
[{"$nulls":11},""]
[{"$nulls":11},""]
[{"$nulls":11},""]
[{"$nulls":11},{"$f":"IF(J4761=\"\",\"\",IF(J4761=\"NHVcz\",\"Btu/scf\",IF(J4761=\"NHVdil\",\"Btu/sq ft\",\"\")))","v":""}]
[{"$nulls":11},""]
[{"$nulls":11},""]
[{"$nulls":11},""]
[{"$nulls":11},""]
[{"$nulls":11},""]
[{"$nulls":11},""]
[{"$nulls":11},""]
[{"$nulls":11},""]
[{"$nulls":11},""]
[{"$nulls":11},""]
[{"$nulls":11},""]
[{"$nulls":11},""]
[{"$nulls":11},""]
[{"$nulls":11},""]
[{"$nulls":11},""]
[{"$nulls":11},""]
[{"$nulls":11},""]
[{"$nulls":11},""]
[{"$nulls":11},""]
[{"$nulls":11},""]
[{"$nulls":11},""]
[{"$nulls":11},""]
[{"$nulls":11},""]
[{"$nulls":11},""]
[{"$nulls":11},""]
[{"$nulls":11},""]
[{"$nulls":11},""]
[{"$nulls":11},""]
[{"$nulls":11},""]
[{"$nulls":11},""]
[{"$nulls":11},""]
[{"$nulls":11},""]
[{"$nulls":11},""]
[{"$nulls":11},""]
[{"$nulls":11},""]
[{"$nulls":11},""]
[{"$nulls":11},""]
[{"$nulls":11},""]
[{"$nulls":11},""]
[{"$nulls":11},""]
[{"$nulls":11},""]
[{"$nulls":11},""]
[{"$nulls":11},""]
[{"$nulls":11},""]
[{"$nulls":11},""]
[{"$nulls":11},""]
[{"$nulls":11},""]
[{"$nulls":11},""]
[{"$nulls":11},""]
[{"$nulls":11},""]
[{"$nulls":11},""]
[{"$nulls":11},""]
[{"$nulls":11},""]
[{"$nulls":11},""]
[{"$nulls":11},""]
[{"$nulls":11},""]
[{"$nulls":11},""]
[{"$nulls":11},""]
[{"$nulls":11},""]
[{"$nulls":11},""]
[{"$nulls":11},""]
[{"$nulls":11},""]
[{"$nulls":11},""]
[{"$nulls":11},{"$f":"IF(J4825=\"\",\"\",IF(J4825=\"NHVcz\",\"Btu/scf\",IF(J4825=\"NHVdil\",\"Btu/sq ft\",\"\")))","v":""}]
[{"$nulls":11},""]
[{"$nulls":11},""]
[{"$nulls":11},""]
[{"$nulls":11},""]
[{"$nulls":11},""]
[{"$nulls":11},""]
[{"$nulls":11},""]
[{"$nulls":11},""]
[{"$nulls":11},""]
[{"$nulls":11},""]
[{"$nulls":11},""]
[{"$nulls":11},""]
[{"$nulls":11},""]
[{"$nulls":11},""]
[{"$nulls":11},""]
[{"$nulls":11},""]
[{"$nulls":11},""]
[{"$nulls":11},""]
[{"$nulls":11},""]
[{"$nulls":11},""]
[{"$nulls":11},""]
[{"$nulls":11},""]
[{"$nulls":11},""]
[{"$nulls":11},""]
[{"$nulls":11},""]
[{"$nulls":11},""]
[{"$nulls":11},""]
[{"$nulls":11},""]
[{"$nulls":11},""]
[{"$nulls":11},""]
[{"$nulls":11},""]
[{"$nulls":11},""]
[{"$nulls":11},""]
[{"$nulls":11},""]
[{"$nulls":11},""]
[{"$nulls":11},""]
[{"$nulls":11},""]
[{"$nulls":11},""]
[{"$nulls":11},""]
[{"$nulls":11},""]
[{"$nulls":11},""]
[{"$nulls":11},""]
[{"$nulls":11},""]
[{"$nulls":11},""]
[{"$nulls":11},""]
[{"$nulls":11},""]
[{"$nulls":11},""]
[{"$nulls":11},""]
[{"$nulls":11},""]
[{"$nulls":11},""]
[{"$nulls":11},""]
[{"$nulls":11},""]
[{"$nulls":11},""]
[{"$nulls":11},""]
[{"$nulls":11},""]
[{"$nulls":11},""]
[{"$nulls":11},""]
[{"$nulls":11},""]
[{"$nulls":11},""]
[{"$nulls":11},""]
[{"$nulls":11},""]
[{"$nulls":11},""]
[{"$nulls":11},""]
[{"$nulls":11},{"$f":"IF(J4889=\"\",\"\",IF(J4889=\"NHVcz\",\"Btu/scf\",IF(J4889=\"NHVdil\",\"Btu/sq ft\",\"\")))","v":""}]
[{"$nulls":11},""]
[{"$nulls":11},""]
[{"$nulls":11},""]
[{"$nulls":11},""]
[{"$nulls":11},""]
[{"$nulls":11},""]
[{"$nulls":11},""]
[{"$nulls":11},""]
[{"$nulls":11},""]
[{"$nulls":11},""]
[{"$nulls":11},""]
[{"$nulls":11},""]
[{"$nulls":11},""]
[{"$nulls":11},""]
[{"$nulls":11},""]
[{"$nulls":11},""]
[{"$nulls":11},""]
[{"$nulls":11},""]
[{"$nulls":11},""]
[{"$nulls":11},""]
[{"$nulls":11},""]
[{"$nulls":11},""]
[{"$nulls":11},""]
[{"$nulls":11},""]
[{"$nulls":11},""]
[{"$nulls":11},""]
[{"$nulls":11},""]
[{"$nulls":11},""]
[{"$nulls":11},""]
[{"$nulls":11},""]
[{"$nulls":11},""]
[{"$nulls":11},""]
[{"$nulls":11},""]
[{"$nulls":11},""]
[{"$nulls":11},""]
[{"$nulls":11},""]
[{"$nulls":11},""]
[{"$nulls":11},""]
[{"$nulls":11},""]
[{"$nulls":11},""]
[{"$nulls":11},""]
[{"$nulls":11},""]
[{"$nulls":11},""]
[{"$nulls":11},""]
[{"$nulls":11},""]
[{"$nulls":11},""]
[{"$nulls":11},""]
[{"$nulls":11},""]
[{"$nulls":11},""]
[{"$nulls":11},""]
[{"$nulls":11},""]
[{"$nulls":11},""]
[{"$nulls":11},""]
[{"$nulls":11},""]
[{"$nulls":11},""]
[{"$nulls":11},""]
[{"$nulls":11},""]
[{"$nulls":11},""]
[{"$nulls":11},""]
[{"$nulls":11},""]
[{"$nulls":11},""]
[{"$nulls":11},""]
[{"$nulls":11},""]
[{"$nulls":11},{"$f":"IF(J4953=\"\",\"\",IF(J4953=\"NHVcz\",\"Btu/scf\",IF(J4953=\"NHVdil\",\"Btu/sq ft\",\"\")))","v":""}]
[{"$nulls":11},""]
[{"$nulls":11},""]
[{"$nulls":11},""]
[{"$nulls":11},""]
[{"$nulls":11},""]
[{"$nulls":11},""]
[{"$nulls":11},""]
[{"$nulls":11},""]
[{"$nulls":11},""]
[{"$nulls":11},""]
[{"$nulls":11},""]
[{"$nulls":11},""]
[{"$nulls":11},""]
[{"$nulls":11},""]
[{"$nulls":11},""]
[{"$nulls":11},""]
[{"$nulls":11},""]
[{"$nulls":11},""]
[{"$nulls":11},""]
[{"$nulls":11},""]
[{"$nulls":11},""]
[{"$nulls":11},""]
[{"$nulls":11},""]
[{"$nulls":11},""]
[{"$nulls":11},""]
[{"$nulls":11},""]
[{"$nulls":11},""]
[{"$nulls":11},""]
[{"$nulls":11},""]
[{"$nulls":11},""]
[{"$nulls":11},""]
[{"$nulls":11},""]
[{"$nulls":11},""]
[{"$nulls":11},""]
[{"$nulls":11},""]
[{"$nulls":11},""]
[{"$nulls":11},""]
[{"$nulls":11},""]
[{"$nulls":11},""]
[{"$nulls":11},""]
[{"$nulls":11},""]
[{"$nulls":11},""]
[{"$nulls":11},""]
[{"$nulls":11},""]
[{"$nulls":11},""]
[{"$nulls":11},""]
[{"$nulls":11},""]
[{"$nulls":11},""]
[{"$nulls":11},""]
[{"$nulls":11},""]
[{"$nulls":11},""]
[{"$nulls":11},""]
[{"$nulls":11},""]
[{"$nulls":11},""]
[{"$nulls":11},""]
[{"$nulls":11},""]
[{"$nulls":11},""]
[{"$nulls":11},""]
[{"$nulls":11},""]
[{"$nulls":11},""]
[{"$nulls":11},""]
[{"$nulls":11},""]
[{"$nulls":11},""]
[{"$nulls":11},{"$f":"IF(J5017=\"\",\"\",IF(J5017=\"NHVcz\",\"Btu/scf\",IF(J5017=\"NHVdil\",\"Btu/sq ft\",\"\")))","v":""}]
[{"$nulls":11},""]
[{"$nulls":11},""]
[{"$nulls":11},""]
[{"$nulls":11},""]
[{"$nulls":11},""]
[{"$nulls":11},""]

{"sheet":"Vapor_Tightness","index":5,"n_rows":23,"n_cols":12,"rows_kept":23,"cut":false,"hidden":false,"merged":[]}
[null,"DO NOT REMOVE OR EDIT INFORMATION IN ROWS 1 THROUGH 5\nFOR INTERNAL USE ONLY"]
[null,{"$f":"Welcome!A2","v":"Template Name"},{"$f":"Welcome!B2","v":"Gasoline Distribution Semiannual Reports (Spreadsheet Template)"}]
[null,{"$f":"Welcome!A3","v":"CitationID"},{"$f":"Welcome!B3","v":"60.505a(c)"}]
[null,{"$f":"Welcome!A4","v":"Template Version"},{"$f":"Welcome!B4","v":"draft"}]
[null,{"$f":"Welcome!A5","v":"Last Updated Date"},{"$f":"Welcome!B5","v":"2023-09-28"}]
[]
[null,{"$f":"Facility_Information!B7","v":"40 CFR Part 60, Subpart XXa, 40 CFR Part 63, Subpart R, 40 CFR Part 63, Subpart BBBBBB - Gasoline Distribution"}]
[null,{"$f":"Facility_Information!B8","v":"§60.505a(c), §63.428(m), and §63.11095(d) Semiannual  Report Spreadsheet Template"}]
[]
[null,"Use this worksheet to report any instance in which liquid product was loaded into a cargo tank for which vapor tightness documentation required under §60.502a(e)(1) or §63.11094(b) was not provided or available in the terminal’s records."]
[null,"Note: Facility Record No. selections appear once a Facility(s) is added to the Facility_Information worksheet. Column L will be blocked out if you indicated no documentation was received in Column K."]
[null,"Facility Record No.\n(Select from dropdown)","Date Liquid Product Was Loaded Without Proper Documentation.\n(§60.505a(c)(4)(iii), §63.428(m)(4)(iii), §63.11095(d)(4)(iii))","Time Liquid Product Was Loaded Without Proper Documentation.\n(§60.505a(c)(4)(iii), §63.428(m)(4)(iii), §63.11095(d)(4)(iii))","Cargo Tank Identification Number\n(§60.505a(c)(4)(ii), §63.428(m)(4)(ii), §63.11095(d)(4)(ii))","Cargo Tank Owner\n(§60.505a(c)(4)(i), §63.428(m)(4)(i), §63.11095(d)(4)(i))","Address\n(§60.505a(c)(4)(i), §63.428(m)(4)(i), §63.11095(d)(4)(i))","City\n(§60.505a(c)(4)(i), §63.428(m)(4)(i), §63.11095(d)(4)(i))","State\n(§60.505a(c)(4)(i), §63.428(m)(4)(i), §63.11095(d)(4)(i))\n(Select from dropdown)","Zip Code\n(§60.505a(c)(4)(i), §63.428(m)(4)(i), §63.11095(d)(4)(i))","Was Proper Documentation Received?\n(§60.505a(c)(4)(iv), §63.428(m)(4)(iv), §63.11095(d)(4)(iv))","Date Proper Documentation Was Received\n(§60.505a(c)(4)(iv), §63.428(m)(4)(iv), §63.11095(d)(4)(iv))"]
[null,"RecordId","TightLoadDate","TightLoadTime","TightTankId","TightTankOwner","TightAddress","TightCity","TightState","TightZip","TightDocumentationFlag","TightDocumentationDate"]
[null,"e.g.: 1","e.g.: 05/01/23","e.g.: 1:00 PM","e.g.:","e.g.:","e.g.: 123 Main Street","e.g.: Brooklyn","e.g.: NY","e.g.: 11221","e.g.: Yes","e.g.: 05/02/23"]
[null,"e.g.","e.g.",null,"e.g.","e.g.","e.g.","e.g.","e.g.","e.g.","e.g.","e.g."]
[null,"e.g.","e.g.",null,"e.g.","e.g.","e.g.","e.g.","e.g.","e.g.","e.g.","e.g."]
[null,"e.g.","e.g.",null,"e.g.","e.g.","e.g.","e.g.","e.g.","e.g.","e.g.","e.g."]
[null,"e.g.","e.g.",null,"e.g.","e.g.","e.g.","e.g.","e.g.","e.g.","e.g.","e.g."]
[null,"e.g.","e.g.",null,"e.g.","e.g.","e.g.","e.g.","e.g.","e.g.","e.g.","e.g."]
[null,"e.g.","e.g.",null,"e.g.","e.g.","e.g.","e.g.","e.g.","e.g.","e.g.","e.g."]
[null,"e.g.","e.g.",null,"e.g.","e.g.","e.g.","e.g.","e.g.","e.g.","e.g.","e.g."]
[null,"e.g.","e.g.",null,"e.g.","e.g.","e.g.","e.g.","e.g.","e.g.","e.g.","e.g."]
[null,"e.g.","e.g.",null,"e.g.","e.g.","e.g.","e.g.","e.g.","e.g.","e.g.","e.g."]

{"sheet":"Vapor_Collection","index":6,"n_rows":23,"n_cols":7,"rows_kept":23,"cut":false,"hidden":false,"merged":[]}
[null,"DO NOT REMOVE OR EDIT INFORMATION IN ROWS 1 THROUGH 5\nFOR INTERNAL USE ONLY"]
[null,{"$f":"Welcome!A2","v":"Template Name"},{"$f":"Welcome!B2","v":"Gasoline Distribution Semiannual Reports (Spreadsheet Template)"}]
[null,{"$f":"Welcome!A3","v":"CitationID"},{"$f":"Welcome!B3","v":"60.505a(c)"}]
[null,{"$f":"Welcome!A4","v":"Template Version"},{"$f":"Welcome!B4","v":"draft"}]
[null,{"$f":"Welcome!A5","v":"Last Updated Date"},{"$f":"Welcome!B5","v":"2023-09-28"}]
[]
[null,{"$f":"Facility_Information!B7","v":"40 CFR Part 60, Subpart XXa, 40 CFR Part 63, Subpart R, 40 CFR Part 63, Subpart BBBBBB - Gasoline Distribution"}]
[null,{"$f":"Facility_Information!B8","v":"§60.505a(c), §63.428(m), and §63.11095(d) Semiannual  Report Spreadsheet Template"}]
[null,"Use this worksheet to report each instance when:\n(1) liquid product was loaded into cargo tanks not using submerged filling, as defined in §60.501a, §63.421, or §63.11100; \n(2) liquid prodcut was loaded into cargo tanks that were not equipped with vapor collection equipment that is compatible with the terminal's vapor collection system; and \n(3) each instance liquid product was loaded into cargo tanks when the terminal's and the cargo tank's vapor collection systems were not properly connected."]
[null,"Use this worksheet to also report instances for 40 CFR part 63 subpart BBBBBB when gasoline was loaded between gasoline cargo tanks and storage tanks and the plant’s vapor balancing system was not properly connected between the gasoline cargo tank and storage tank."]
[null,"Note: Facility Record No. selections appear once a Facility(s) is added to the Facility_Information worksheet."]
[null,"Facility Record No.\n(Select from dropdown)","Date Liquid Product/Gasoline Loaded Into Improperly Equipped or Improperly Connected Cargo Tank or Gasoline Storage Tank\n(§60.505a(c)(5)(i), §63.428(m)(5)(i), §63.11095(d)(5)(i), §63.11095(d)(6)(i))","Time Liquid Product/Gasoline Loaded Into Improperly Equipped or Improperly Connected Cargo Tank or Gasoline Storage Tank\n(§60.505a(c)(5)(i), §63.428(m)(5)(i), §63.11095(d)(5)(i), §63.11095(d)(6)(i))","Type of Deviation\n(§60.505a(c)(5)(ii), §63.428(m)(5)(ii), §63.11095(d)(5)(ii), §63.11095(d)(6))","Cargo Tank Identification Number\n(§60.505a(c)(5)(iii), §63.428(m)(5)(iii), §63.11095(d)(5)(iii), §63.11095(d)(6)(ii))","Storage Tank Identification Number\n(§63.11095(d)(6)(ii))"]
[null,"RecordId","CollectionLoadDate","CollectionLoadTime","CollectionDeviation","CollectionCargoId","CollectionStorageId"]
[null,"e.g.: 1","e.g.: 05/01/23","e.g.: 12:30 PM","e.g.: not submerged filling","e.g.:","e.g.:"]
[null,"e.g.","e.g.","e.g.","e.g.","e.g.","e.g."]
[null,"e.g.","e.g.","e.g.","e.g.","e.g.","e.g."]
[null,"e.g.","e.g.","e.g.","e.g.","e.g.","e.g."]
[null,"e.g.","e.g.","e.g.","e.g.","e.g.","e.g."]
[null,"e.g.","e.g.","e.g.","e.g.","e.g.","e.g."]
[null,"e.g.","e.g.","e.g.","e.g.","e.g.","e.g."]
[null,"e.g.","e.g.","e.g.","e.g.","e.g.","e.g."]
[null,"e.g.","e.g.","e.g.","e.g.","e.g.","e.g."]
[null,"e.g.","e.g.","e.g.","e.g.","e.g.","e.g."]

{"sheet":"Monitored_Leaks","index":7,"n_rows":23,"n_cols":10,"rows_kept":23,"cut":false,"hidden":false,"merged":[]}
[null,"DO NOT REMOVE OR EDIT INFORMATION IN ROWS 1 THROUGH 5\nFOR INTERNAL USE ONLY"]
[null,{"$f":"Welcome!A2","v":"Template Name"},{"$f":"Welcome!B2","v":"Gasoline Distribution Semiannual Reports (Spreadsheet Template)"}]
[null,{"$f":"Welcome!A3","v":"CitationID"},{"$f":"Welcome!B3","v":"60.505a(c)"}]
[null,{"$f":"Welcome!A4","v":"Template Version"},{"$f":"Welcome!B4","v":"draft"}]
[null,{"$f":"Welcome!A5","v":"Last Updated Date"},{"$f":"Welcome!B5","v":"2023-09-28"}]
[]
[null,{"$f":"Facility_Information!B7","v":"40 CFR Part 60, Subpart XXa, 40 CFR Part 63, Subpart R, 40 CFR Part 63, Subpart BBBBBB - Gasoline Distribution"}]
[null,{"$f":"Facility_Information!B8","v":"§60.505a(c), §63.428(m), and §63.11095(d) Semiannual  Report Spreadsheet Template"}]
[null,"Use this worksheet to report information on leaks detected during a leak inspection required under §60.502a(j)(1), §60.503a(a)(2), §63.424(c), or §63.11089(c)."]
[null,"Note: Facility Record No. selections appear once a Facility(s) is added to the Facility_Information worksheet."]
[]
[null,"Facility Record No.\n(Select from dropdown)","Date of Inspection\n(§60.505a(c)(6)(i)(A), §63.428(m)(6)(i)(A), §63.11095(d)(7)(i)(A)) ","Leak Determination Method\n(§60.505a(c)(6)(i)(B), §63.428(m)(6)(i)(B), §63.11095(d)(7)(i)(B))\n(Select from dropdown list) ","Type of Component for which Leak is Detected\n(§60.505a(c)(6)(i)(C)-(F), §63.428(m)(6)(i)(C)-(F), §63.11095(d)(7)(i)(C)-(F))","Specify Component Type if Column E is \"Other\"\n(§60.505a(c)(6)(i)(C)-(F), §63.428(m)(6)(i)(C)-(F), §63.11095(d)(7)(i)(C)-(F))","Number of Leaks Detected for Component Type\n(§60.505a(c)(6)(i)(C), §63.428(m)(6)(i)(C), §63.11095(d)(7)(i)(C)) ","Number of Leaks Repaired in 15 Calendar Days for Component Type\n(§60.505a(c)(6)(i)(D), §63.428(m)(6)(i)(D), §63.11095(d)(7)(i)(D))","Number of Leaks For Which There Was No Repair Attempt Within 5 Days for Component Type\n(§60.505a(c)(6)(i)(E), §63.428(m)(6)(i)(E), §63.11095(d)(7)(i)(E))","Number of Components Placed on Delay of Repair for Component Type\n(§60.505a(c)(6)(i)(F), §63.428(m)(6)(i)(F), §63.11095(d)(7)(i)(F))  "]
[null,"RecordId","LeakInspectDate","LeakMethod","LeakComponent","LeakCompOther","LeakNumber","LeakRepaired","LeakFirstAttempt","LeakRepairDelayed"]
[null,"e.g.: 1","e.g.: 04/02/23","e.g.: OGI","e.g.: valve","e.g.:","e.g.: 3","e.g.: 1","e.g.: 1","e.g.: 1"]
[null,"e.g.:","e.g.:","e.g.:","e.g.:",null,"e.g.:","e.g.:","e.g.:","e.g.:"]
[null,"e.g.:","e.g.:","e.g.:","e.g.:",null,"e.g.:","e.g.:","e.g.:","e.g.:"]
[null,"e.g.:","e.g.:","e.g.:","e.g.:",null,"e.g.:","e.g.:","e.g.:","e.g.:"]
[null,"e.g.:","e.g.:","e.g.:","e.g.:",null,"e.g.:","e.g.:","e.g.:","e.g.:"]
[null,"e.g.:","e.g.:","e.g.:","e.g.:",null,"e.g.:","e.g.:","e.g.:","e.g.:"]
[null,"e.g.:","e.g.:","e.g.:","e.g.:",null,"e.g.:","e.g.:","e.g.:","e.g.:"]
[null,"e.g.:","e.g.:","e.g.:","e.g.:",null,"e.g.:","e.g.:","e.g.:","e.g.:"]
[null,"e.g.:","e.g.:","e.g.:","e.g.:",null,"e.g.:","e.g.:","e.g.:","e.g.:"]
[null,"e.g.:","e.g.:","e.g.:","e.g.:",null,"e.g.:","e.g.:","e.g.:","e.g.:"]

{"sheet":"AVO_Leaks","index":8,"n_rows":23,"n_cols":8,"rows_kept":23,"cut":false,"hidden":false,"merged":[]}
[null,"DO NOT REMOVE OR EDIT INFORMATION IN ROWS 1 THROUGH 5\nFOR INTERNAL USE ONLY"]
[null,{"$f":"Welcome!A2","v":"Template Name"},{"$f":"Welcome!B2","v":"Gasoline Distribution Semiannual Reports (Spreadsheet Template)"}]
[null,{"$f":"Welcome!A3","v":"CitationID"},{"$f":"Welcome!B3","v":"60.505a(c)"}]
[null,{"$f":"Welcome!A4","v":"Template Version"},{"$f":"Welcome!B4","v":"draft"}]
[null,{"$f":"Welcome!A5","v":"Last Updated Date"},{"$f":"Welcome!B5","v":"2023-09-28"}]
[]
[null,{"$f":"Facility_Information!B7","v":"40 CFR Part 60, Subpart XXa, 40 CFR Part 63, Subpart R, 40 CFR Part 63, Subpart BBBBBB - Gasoline Distribution"}]
[null,{"$f":"Facility_Information!B8","v":"§60.505a(c), §63.428(m), and §63.11095(d) Semiannual  Report Spreadsheet Template"}]
[null,"Use this worksheet to report leaks identified by audio, visual, or olfactory methods under §60.502a(j)(2), §63.424(c), or §63.11089(c)."]
[null,"Note: Facility Record No. selections appear once a Facility(s) is added to the Facility_Information worksheet."]
[]
[null,"Facility Record No.\n(Select from dropdown)","Type of Component for which Leak is Detected\n(§60.505a(c)(6)(ii)(A)-(D), §63.428(m)(6)(ii)(A)-(D), §63.11095(d)(7)(ii)(A)-(D))","Specify Component Type if Column C is \"Other\"\n(§60.505a(c)(6)(ii)(A)-(D), §63.428(m)(6)(ii)(A)-(D), §63.11095(d)(7)(ii)(A)-(D))","Number of Leaks Detected for Component Type\n(§60.505a(c)(6)(ii)(A), §63.428(m)(6)(ii)(A), §63.11095(d)(7)(ii)(A)) ","Number of Leaks Repaired in 15 Calendar Days for Component Type\n(§60.505a(c)(6)(ii)(B), §63.428(m)(6)(ii)(B), §63.11095(d)(7)(ii)(B))","Number of Leaks For Which There Was No Repair Attempt Within 5 Days for Component Type\n(§60.505a(c)(6)(ii)(C), §63.428(m)(6)(ii)(C), §63.11095(d)(7)(ii)(C))","Number of Components Placed on Delay of Repair for Component Type\n(§60.505a(c)(6)(ii)(D), §63.428(m)(6)(ii)(D), §63.11095(d)(7)(ii)(D))"]
[null,"RecordId","AvoComponent","AvoCompOther","AvoNumber","AvoRepaired","AvoFirstAttempt","AvoRepairDelayed"]
[null,"e.g.: 1","e.g.: valve","e.g.:","e.g.: 2","e.g.: 1","e.g.: 1","e.g.: 1"]
[null,"e.g.","e.g.",null,"e.g.","e.g.","e.g.","e.g."]
[null,"e.g.","e.g.",null,"e.g.","e.g.","e.g.","e.g."]
[null,"e.g.","e.g.",null,"e.g.","e.g.","e.g.","e.g."]
[null,"e.g.","e.g.",null,"e.g.","e.g.","e.g.","e.g."]
[null,"e.g.","e.g.",null,"e.g.","e.g.","e.g.","e.g."]
[null,"e.g.","e.g.",null,"e.g.","e.g.","e.g.","e.g."]
[null,"e.g.","e.g.",null,"e.g.","e.g.","e.g.","e.g."]
[null,"e.g.","e.g.",null,"e.g.","e.g.","e.g.","e.g."]
[null,"e.g.","e.g.",null,"e.g.","e.g.","e.g.","e.g."]

{"sheet":"Delay_of_Repair","index":9,"n_rows":23,"n_cols":9,"rows_kept":23,"cut":false,"hidden":false,"merged":[]}
[null,"DO NOT REMOVE OR EDIT INFORMATION IN ROWS 1 THROUGH 5\nFOR INTERNAL USE ONLY"]
[null,"Template Name",{"$f":"Welcome!B2","v":"Gasoline Distribution Semiannual Reports (Spreadsheet Template)"}]
[null,"CitationID",{"$f":"Welcome!B3","v":"60.505a(c)"}]
[null,"Template Version",{"$f":"Welcome!B4","v":"draft"}]
[null,"Last Updated Date",{"$f":"Welcome!B5","v":"2023-09-28"}]
[]
[null,{"$f":"Facility_Information!B7","v":"40 CFR Part 60, Subpart XXa, 40 CFR Part 63, Subpart R, 40 CFR Part 63, Subpart BBBBBB - Gasoline Distribution"}]
[null,{"$f":"Facility_Information!B8","v":"§60.505a(c), §63.428(m), and §63.11095(d) Semiannual  Report Spreadsheet Template"}]
[null,"Use this worksheet to report information for each leak that was on the delay of repair list at any time during the reporting period."]
[null,"Note: Facility Record No. selections appear once a Facility(s) is added to the Facility_Information worksheet."]
[]
[null,"Facility Record No.\n(Select from dropdown)","Unique Equipment Component Identification Number\n(§60.505a(c)(6)(v)(A), §63.428(m)(6)(v)(A), §63.11095(d)(7)(v)(A))","Type of Equipment Component\n(§60.505a(c)(6)(v)(B), §63.428(m)(6)(v)(B), §63.11095(d)(7)(v)(B))","Specify Component Type if Column D is \"Other\"\n(§60.505a(c)(6)(v)(B), §63.428(m)(6)(v)(B), §63.11095(d)(7)(v)(B))","Leak Determination Method\n(§60.505a(c)(6)(v)(C), §63.428(m)(6)(v)(C), §63.11095(d)(7)(v)(C))\n(Select from dropdown)","Reason Why Repair Was Not Feasible Within 15 days\n(§60.505a(c)(6)(v)(D), §63.428(m)(6)(v)(D), §63.11095(d)(7)(v)(D))","Specify Reason if Column G is \"Other\"","Date Repair Completed\n(If Applicable)\n(§60.505a(c)(6)(v)(E), §63.428(m)(6)(v)(E), §63.11095(d)(7)(v)(E))"]
[null,"RecordId","DelayCompId","DelayCompType","DelayCompTypeOther","DelayLeakMethod","DelayReason","DelayOtherReason","DelayRepairDate"]
[null,"e.g.: 1","e.g.:HRLVLV2891","e.g.: valve","e.g.:","e.g.: OGI","e.g.: Replacement parts unavailable","e.g.:","e.g.: 05/31/23"]
[null,"e.g.","e.g.","e.g.",null,"e.g.","e.g.",null,"e.g."]
[null,"e.g.","e.g.","e.g.",null,"e.g.","e.g.",null,"e.g."]
[null,"e.g.","e.g.","e.g.",null,"e.g.","e.g.",null,"e.g."]
[null,"e.g.","e.g.","e.g.",null,"e.g.","e.g.",null,"e.g."]
[null,"e.g.","e.g.","e.g.",null,"e.g.","e.g.",null,"e.g."]
[null,"e.g.","e.g.","e.g.",null,"e.g.","e.g.",null,"e.g."]
[null,"e.g.","e.g.","e.g.",null,"e.g.","e.g.",null,"e.g."]
[null,"e.g.","e.g.","e.g.",null,"e.g.","e.g.",null,"e.g."]
[null,"e.g.","e.g.","e.g.",null,"e.g.","e.g.",null,"e.g."]

{"sheet":"LEL","index":10,"n_rows":23,"n_cols":10,"rows_kept":23,"cut":false,"hidden":false,"merged":[]}
[null,"DO NOT REMOVE OR EDIT INFORMATION IN ROWS 1 THROUGH 5\nFOR INTERNAL USE ONLY"]
[null,"Template Name",{"$f":"Welcome!B2","v":"Gasoline Distribution Semiannual Reports (Spreadsheet Template)"}]
[null,"CitationID",{"$f":"Welcome!B3","v":"60.505a(c)"}]
[null,"Template Version",{"$f":"Welcome!B4","v":"draft"}]
[null,"Last Updated Date",{"$f":"Welcome!B5","v":"2023-09-28"}]
[]
[null,{"$f":"Facility_Information!B7","v":"40 CFR Part 60, Subpart XXa, 40 CFR Part 63, Subpart R, 40 CFR Part 63, Subpart BBBBBB - Gasoline Distribution"}]
[null,{"$f":"Facility_Information!B8","v":"§60.505a(c), §63.428(m), and §63.11095(d) Semiannual  Report Spreadsheet Template"}]
[null,"Use this worksheet to report deviations in LEL monitoring if you are complying with §63.423(c)(2) or options 2(c) or 2(e) in Table 1 to 40 CFR part 63 subpart BBBBBB."]
[null,"Note: Facility Record No. selections appear once a Facility(s) is added to the Facility_Information worksheet."]
[]
[null,"Facility Record No.\n(Select from dropdown)","Storage Vessel Being Monitored\n(§63.428(m)(7)(ii)(A), §63.11095(d)(8)(ii)(A))","Date of Monitoring\n(§63.428(m)(7)(ii)(A), §63.11095(d)(8)(ii)(A))","Start Time of Monitoring\n(§63.428(m)(7)(ii)(A), §63.11095(d)(8)(ii)(A))","End Time of Monitoring\n(§63.428(m)(7)(ii)(A), §63.11095(d)(8)(ii)(A))","Description of the Monitoring Event\n(§63.428(m)(7)(ii)(B), §63.11095(d)(8)(ii)(B))","Wind Speed at Top of Storage Vessel on Date of Monitoring\n(miles per hour)\n(§63.428(m)(7)(ii)(C), §63.11095(d)(8)(ii)(C))","Highest 5-Minute Rolling Average LEL During Monitoring\n(percent)\n(§63.428(m)(7)(ii)(D), §63.11095(d)(8)(ii)(D))","Which action was taken?\n(§63.428(m)(7)(ii)(E), §63.11095(d)(8)(ii)(E)) "]
[null,"RecordId","LelTankId","LelDate","LelStartTime","LelEndTime","LelDescription","LelWindSpeed","LelPercent","LelAction"]
[null,"e.g.: 1","e.g.: Tank 123AB","e.g.: 11/21/24","e.g.: 2:30 PM","e.g.: 2:50 PM","e.g.: Re-monitoring due to high winds","e.g.: 3","e.g.: 30.1%","e.g.: Roof repaired"]
[null,"e.g.","e.g.","e.g.","e.g.","e.g.","e.g.","e.g.","e.g.","e.g."]
[null,"e.g.","e.g.","e.g.","e.g.","e.g.","e.g.","e.g.","e.g.","e.g."]
[null,"e.g.","e.g.","e.g.","e.g.","e.g.","e.g.","e.g.","e.g.","e.g."]
[null,"e.g.","e.g.","e.g.","e.g.","e.g.","e.g.","e.g.","e.g.","e.g."]
[null,"e.g.","e.g.","e.g.","e.g.","e.g.","e.g.","e.g.","e.g.","e.g."]
[null,"e.g.","e.g.","e.g.","e.g.","e.g.","e.g.","e.g.","e.g.","e.g."]
[null,"e.g.","e.g.","e.g.","e.g.","e.g.","e.g.","e.g.","e.g.","e.g."]
[null,"e.g.","e.g.","e.g.","e.g.","e.g.","e.g.","e.g.","e.g.","e.g."]
[null,"e.g.","e.g.","e.g.","e.g.","e.g.","e.g.","e.g.","e.g.","e.g."]

{"sheet":"Revisions","index":11,"n_rows":2,"n_cols":3,"rows_kept":2,"cut":false,"hidden":false,"merged":[]}
["Revision Number","Date","Description"]
[1,null,"Finalized Release Version"]

{"sheet":"Worksheet Map","index":12,"n_rows":11,"n_cols":5,"rows_kept":11,"cut":false,"hidden":true,"merged":[]}
["Worksheet Name","Parent","JSON Key","Parent Primary Key","Child Foreign Key"]
["Facility_Information",null,"records"]
["General_Information","records","GeneralInformation","RecordId","RecordId"]
["CMS_Deviation_Outage","records","CMSDeviationOutage","RecordId","RecordId"]
["Flares","records","Flares","RecordId","RecordId"]
["Vapor_Tightness","records","VaporTightness","RecordId","RecordId"]
["Vapor_Collection","records","VaporCollection","RecordId","RecordId"]
["Monitored_Leaks","records","MonitoredLeaks","RecordId","RecordId"]
["AVO_Leaks","records","AVOLeaks","RecordId","RecordId"]
["Delay_of_Repair","records","DelayOfRepair","RecordId","RecordId"]
["LEL","records","LEL","RecordId","RecordId"]

{"sheet":"Lists","index":13,"n_rows":201,"n_cols":8,"rows_kept":201,"cut":false,"hidden":true,"merged":[]}
["Company","Number","Company List",null,"States",null,"Limit Units"]
[{"$f":"IF(SUMPRODUCT(--(LEN(Facility_Information!B24:B212)>0))>0,IF(Facility_Information!B24=\"\",\"\",Facility_Information!B24),\"Add a facility in the Facility Information tab\")","v":"Add a facility in the Facility Information tab"},{"$f":"IF(Table5[[#This Row],[Company]]=\"\",\"\",MAX(B1:B$1)+1)","v":1},{"$f":"+IFERROR(INDEX($A$2:$A$190,MATCH(ROW()-ROW($C$1),$B$2:$B$190,0)),\"\")","v":"Add a facility in the Facility Information tab"},null,"AK",null,"ppmv (excludes methane)"]
[{"$f":"IF(Facility_Information!B25=\"\",\"\",Facility_Information!B25)","v":""},{"$f":"IF(Table5[[#This Row],[Company]]=\"\",\"\",MAX(B$1:B2)+1)","v":""},"",null,"AL",null,"ppmv (includes methane)"]
[{"$f":"IF(Facility_Information!B26=\"\",\"\",Facility_Information!B26)","v":""},{"$f":"IF(Table5[[#This Row],[Company]]=\"\",\"\",MAX(B$1:B3)+1)","v":""},"",null,"AR",null,"° C"]
[{"$f":"IF(Facility_Information!B27=\"\",\"\",Facility_Information!B27)","v":""},{"$f":"IF(Table5[[#This Row],[Company]]=\"\",\"\",MAX(B$1:B4)+1)","v":""},"",null,"AS",null,"° F"]
[{"$f":"IF(Facility_Information!B28=\"\",\"\",Facility_Information!B28)","v":""},{"$f":"IF(Table5[[#This Row],[Company]]=\"\",\"\",MAX(B$1:B5)+1)","v":""},"",null,"AZ",null,"inches of water"]
[{"$f":"IF(Facility_Information!B29=\"\",\"\",Facility_Information!B29)","v":""},{"$f":"IF(Table5[[#This Row],[Company]]=\"\",\"\",MAX(B$1:B6)+1)","v":""},"",null,"CA",null,"mm of water"]
[{"$f":"IF(Facility_Information!B30=\"\",\"\",Facility_Information!B30)","v":""},{"$f":"IF(Table5[[#This Row],[Company]]=\"\",\"\",MAX(B$1:B7)+1)","v":""},"",null,"CO",null,"gallons"]
[{"$f":"IF(Facility_Information!B31=\"\",\"\",Facility_Information!B31)","v":""},{"$f":"IF(Table5[[#This Row],[Company]]=\"\",\"\",MAX(B$1:B8)+1)","v":""},"",null,"CT"]
[{"$f":"IF(Facility_Information!B32=\"\",\"\",Facility_Information!B32)","v":""},{"$f":"IF(Table5[[#This Row],[Company]]=\"\",\"\",MAX(B$1:B9)+1)","v":""},"",null,"DC",null,"CMS"]
[{"$f":"IF(Facility_Information!B33=\"\",\"\",Facility_Information!B33)","v":""},{"$f":"IF(Table5[[#This Row],[Company]]=\"\",\"\",MAX(B$1:B10)+1)","v":""},"",null,"DE",null,"Deviation from Limit"]
[{"$f":"IF(Facility_Information!B34=\"\",\"\",Facility_Information!B34)","v":""},{"$f":"IF(Table5[[#This Row],[Company]]=\"\",\"\",MAX(B$1:B11)+1)","v":""},"",null,"FL",null,"Out of Control"]
[{"$f":"IF(Facility_Information!B35=\"\",\"\",Facility_Information!B35)","v":""},{"$f":"IF(Table5[[#This Row],[Company]]=\"\",\"\",MAX(B$1:B12)+1)","v":""},"",null,"GA",null,"CMS Outage"]
[{"$f":"IF(Facility_Information!B36=\"\",\"\",Facility_Information!B36)","v":""},{"$f":"IF(Table5[[#This Row],[Company]]=\"\",\"\",MAX(B$1:B13)+1)","v":""},"",null,"GU"]
[{"$f":"IF(Facility_Information!B37=\"\",\"\",Facility_Information!B37)","v":""},{"$f":"IF(Table5[[#This Row],[Company]]=\"\",\"\",MAX(B$1:B14)+1)","v":""},"",null,"HI",null,"Deviations"]
[{"$f":"IF(Facility_Information!B38=\"\",\"\",Facility_Information!B38)","v":""},{"$f":"IF(Table5[[#This Row],[Company]]=\"\",\"\",MAX(B$1:B15)+1)","v":""},"",null,"IA",null,"monitor equipment malfunction"]
[{"$f":"IF(Facility_Information!B39=\"\",\"\",Facility_Information!B39)","v":""},{"$f":"IF(Table5[[#This Row],[Company]]=\"\",\"\",MAX(B$1:B16)+1)","v":""},"",null,"ID",null,"non-monitor equipment malfunctions"]
[{"$f":"IF(Facility_Information!B40=\"\",\"\",Facility_Information!B40)","v":""},{"$f":"IF(Table5[[#This Row],[Company]]=\"\",\"\",MAX(B$1:B17)+1)","v":""},"",null,"IL",null,"quality assurance calibration"]
[{"$f":"IF(Facility_Information!B41=\"\",\"\",Facility_Information!B41)","v":""},{"$f":"IF(Table5[[#This Row],[Company]]=\"\",\"\",MAX(B$1:B18)+1)","v":""},"",null,"IN",null,"startup/shutdown"]
[{"$f":"IF(Facility_Information!B42=\"\",\"\",Facility_Information!B42)","v":""},{"$f":"IF(Table5[[#This Row],[Company]]=\"\",\"\",MAX(B$1:B19)+1)","v":""},"",null,"KS",null,"control equipment problems"]
[{"$f":"IF(Facility_Information!B43=\"\",\"\",Facility_Information!B43)","v":""},{"$f":"IF(Table5[[#This Row],[Company]]=\"\",\"\",MAX(B$1:B20)+1)","v":""},"",null,"KY",null,"process problems"]
[{"$f":"IF(Facility_Information!B44=\"\",\"\",Facility_Information!B44)","v":""},{"$f":"IF(Table5[[#This Row],[Company]]=\"\",\"\",MAX(B$1:B21)+1)","v":""},"",null,"LA",null,"other known causes"]
[{"$f":"IF(Facility_Information!B45=\"\",\"\",Facility_Information!B45)","v":""},{"$f":"IF(Table5[[#This Row],[Company]]=\"\",\"\",MAX(B$1:B22)+1)","v":""},"",null,"MA",null,"unknown causes"]
[{"$f":"IF(Facility_Information!B46=\"\",\"\",Facility_Information!B46)","v":""},{"$f":"IF(Table5[[#This Row],[Company]]=\"\",\"\",MAX(B$1:B23)+1)","v":""},"",null,"MD"]
[{"$f":"IF(Facility_Information!B47=\"\",\"\",Facility_Information!B47)","v":""},{"$f":"IF(Table5[[#This Row],[Company]]=\"\",\"\",MAX(B$1:B24)+1)","v":""},"",null,"ME",null,"Flare Deviations"]
[{"$f":"IF(Facility_Information!B48=\"\",\"\",Facility_Information!B48)","v":""},{"$f":"IF(Table5[[#This Row],[Company]]=\"\",\"\",MAX(B$1:B25)+1)","v":""},"",null,"MI",null,"No pilot flame present"]
[{"$f":"IF(Facility_Information!B49=\"\",\"\",Facility_Information!B49)","v":""},{"$f":"IF(Table5[[#This Row],[Company]]=\"\",\"\",MAX(B$1:B26)+1)","v":""},"",null,"MN",null,"Visible emissions exceed 5 minutes"]
[{"$f":"IF(Facility_Information!B50=\"\",\"\",Facility_Information!B50)","v":""},{"$f":"IF(Table5[[#This Row],[Company]]=\"\",\"\",MAX(B$1:B27)+1)","v":""},"",null,"MO",null,"Applicable operating limits not met"]
[{"$f":"IF(Facility_Information!B51=\"\",\"\",Facility_Information!B51)","v":""},{"$f":"IF(Table5[[#This Row],[Company]]=\"\",\"\",MAX(B$1:B28)+1)","v":""},"",null,"MP",null,"Flare monitoring was not performed while routing gasoline vapor to flare"]
[{"$f":"IF(Facility_Information!B52=\"\",\"\",Facility_Information!B52)","v":""},{"$f":"IF(Table5[[#This Row],[Company]]=\"\",\"\",MAX(B$1:B29)+1)","v":""},"",null,"MS"]
[{"$f":"IF(Facility_Information!B53=\"\",\"\",Facility_Information!B53)","v":""},{"$f":"IF(Table5[[#This Row],[Company]]=\"\",\"\",MAX(B$1:B30)+1)","v":""},"",null,"MT",null,"Flare Parameters"]
[{"$f":"IF(Facility_Information!B54=\"\",\"\",Facility_Information!B54)","v":""},{"$f":"IF(Table5[[#This Row],[Company]]=\"\",\"\",MAX(B$1:B31)+1)","v":""},"",null,"NC",null,"supplemental gas flow"]
[{"$f":"IF(Facility_Information!B55=\"\",\"\",Facility_Information!B55)","v":""},{"$f":"IF(Table5[[#This Row],[Company]]=\"\",\"\",MAX(B$1:B32)+1)","v":""},"",null,"ND",null,"NHVcz"]
[{"$f":"IF(Facility_Information!B56=\"\",\"\",Facility_Information!B56)","v":""},{"$f":"IF(Table5[[#This Row],[Company]]=\"\",\"\",MAX(B$1:B33)+1)","v":""},{"$f":"+IFERROR(INDEX($A$2:$A$190,MATCH(ROW()-ROW($C$1),$B$2:$B$190,0)),\"\")","v":""},null,"NE",null,"NHVdil"]
[{"$f":"IF(Facility_Information!B57=\"\",\"\",Facility_Information!B57)","v":""},{"$f":"IF(Table5[[#This Row],[Company]]=\"\",\"\",MAX(B$1:B34)+1)","v":""},"",null,"NH"]
[{"$f":"IF(Facility_Information!B58=\"\",\"\",Facility_Information!B58)","v":""},{"$f":"IF(Table5[[#This Row],[Company]]=\"\",\"\",MAX(B$1:B35)+1)","v":""},"",null,"NJ",null,"Improper Vapor Collection"]
[{"$f":"IF(Facility_Information!B59=\"\",\"\",Facility_Information!B59)","v":""},{"$f":"IF(Table5[[#This Row],[Company]]=\"\",\"\",MAX(B$1:B36)+1)","v":""},"",null,"NM",null,"improperly connected vapor collection system"]
[{"$f":"IF(Facility_Information!B60=\"\",\"\",Facility_Information!B60)","v":""},{"$f":"IF(Table5[[#This Row],[Company]]=\"\",\"\",MAX(B$1:B37)+1)","v":""},"",null,"NV",null,"not submerged filling"]
[{"$f":"IF(Facility_Information!B61=\"\",\"\",Facility_Information!B61)","v":""},{"$f":"IF(Table5[[#This Row],[Company]]=\"\",\"\",MAX(B$1:B38)+1)","v":""},"",null,"NY",null,"incompatible equipment"]
[{"$f":"IF(Facility_Information!B62=\"\",\"\",Facility_Information!B62)","v":""},{"$f":"IF(Table5[[#This Row],[Company]]=\"\",\"\",MAX(B$1:B39)+1)","v":""},"",null,"OH",null,"not submerged filling and incompatible equipment"]
[{"$f":"IF(Facility_Information!B63=\"\",\"\",Facility_Information!B63)","v":""},{"$f":"IF(Table5[[#This Row],[Company]]=\"\",\"\",MAX(B$1:B40)+1)","v":""},"",null,"OK",null,"gasoline was loaded between gasoline cargo tanks and storage tanks and the plant’s vapor balancing system was not properly connected"]
[{"$f":"IF(Facility_Information!B64=\"\",\"\",Facility_Information!B64)","v":""},{"$f":"IF(Table5[[#This Row],[Company]]=\"\",\"\",MAX(B$1:B41)+1)","v":""},"",null,"OR"]
[{"$f":"IF(Facility_Information!B65=\"\",\"\",Facility_Information!B65)","v":""},{"$f":"IF(Table5[[#This Row],[Company]]=\"\",\"\",MAX(B$1:B42)+1)","v":""},"",null,"PA",null,"Leak Method"]
[{"$f":"IF(Facility_Information!B66=\"\",\"\",Facility_Information!B66)","v":""},{"$f":"IF(Table5[[#This Row],[Company]]=\"\",\"\",MAX(B$1:B43)+1)","v":""},"",null,"PR",null,"Method 21"," "]
[{"$f":"IF(Facility_Information!B67=\"\",\"\",Facility_Information!B67)","v":""},{"$f":"IF(Table5[[#This Row],[Company]]=\"\",\"\",MAX(B$1:B44)+1)","v":""},"",null,"RI",null,"OGI"]
[{"$f":"IF(Facility_Information!B68=\"\",\"\",Facility_Information!B68)","v":""},{"$f":"IF(Table5[[#This Row],[Company]]=\"\",\"\",MAX(B$1:B45)+1)","v":""},"",null,"SC",null,"AVO"]
[{"$f":"IF(Facility_Information!B69=\"\",\"\",Facility_Information!B69)","v":""},{"$f":"IF(Table5[[#This Row],[Company]]=\"\",\"\",MAX(B$1:B46)+1)","v":""},"",null,"SD"]
[{"$f":"IF(Facility_Information!B70=\"\",\"\",Facility_Information!B70)","v":""},{"$f":"IF(Table5[[#This Row],[Company]]=\"\",\"\",MAX(B$1:B47)+1)","v":""},"",null,"TN",null,"Component Type"]
[{"$f":"IF(Facility_Information!B71=\"\",\"\",Facility_Information!B71)","v":""},{"$f":"IF(Table5[[#This Row],[Company]]=\"\",\"\",MAX(B$1:B48)+1)","v":""},"",null,"TX",null,"pump"]
[{"$f":"IF(Facility_Information!B72=\"\",\"\",Facility_Information!B72)","v":""},{"$f":"IF(Table5[[#This Row],[Company]]=\"\",\"\",MAX(B$1:B49)+1)","v":""},"",null,"UT",null,"valve"]
[{"$f":"IF(Facility_Information!B73=\"\",\"\",Facility_Information!B73)","v":""},{"$f":"IF(Table5[[#This Row],[Company]]=\"\",\"\",MAX(B$1:B50)+1)","v":""},"",null,"VA",null,"flange"]
[{"$f":"IF(Facility_Information!B74=\"\",\"\",Facility_Information!B74)","v":""},{"$f":"IF(Table5[[#This Row],[Company]]=\"\",\"\",MAX(B$1:B51)+1)","v":""},"",null,"VI",null,"connector (other than flange)"]
[{"$f":"IF(Facility_Information!B75=\"\",\"\",Facility_Information!B75)","v":""},{"$f":"IF(Table5[[#This Row],[Company]]=\"\",\"\",MAX(B$1:B52)+1)","v":""},"",null,"VT",null,"open-ended line"]
[{"$f":"IF(Facility_Information!B76=\"\",\"\",Facility_Information!B76)","v":""},{"$f":"IF(Table5[[#This Row],[Company]]=\"\",\"\",MAX(B$1:B53)+1)","v":""},"",null,"WA",null,"sampling connection"]
[{"$f":"IF(Facility_Information!B77=\"\",\"\",Facility_Information!B77)","v":""},{"$f":"IF(Table5[[#This Row],[Company]]=\"\",\"\",MAX(B$1:B54)+1)","v":""},"",null,"WI",null,"pressure relief device"]
[{"$f":"IF(Facility_Information!B78=\"\",\"\",Facility_Information!B78)","v":""},{"$f":"IF(Table5[[#This Row],[Company]]=\"\",\"\",MAX(B$1:B55)+1)","v":""},"",null,"WV",null,"Other (specify in next column)"]
[{"$f":"IF(Facility_Information!B79=\"\",\"\",Facility_Information!B79)","v":""},{"$f":"IF(Table5[[#This Row],[Company]]=\"\",\"\",MAX(B$1:B56)+1)","v":""},"",null,"WY"]
[{"$f":"IF(Facility_Information!B80=\"\",\"\",Facility_Information!B80)","v":""},{"$f":"IF(Table5[[#This Row],[Company]]=\"\",\"\",MAX(B$1:B57)+1)","v":""},"",null,null,null,"Facility Types"]
[{"$f":"IF(Facility_Information!B81=\"\",\"\",Facility_Information!B81)","v":""},{"$f":"IF(Table5[[#This Row],[Company]]=\"\",\"\",MAX(B$1:B58)+1)","v":""},"",null,null,null,"bulk gasoline terminal"]
[{"$f":"IF(Facility_Information!B82=\"\",\"\",Facility_Information!B82)","v":""},{"$f":"IF(Table5[[#This Row],[Company]]=\"\",\"\",MAX(B$1:B59)+1)","v":""},"",null,null,null,"pipeline breakout station"]
[{"$f":"IF(Facility_Information!B83=\"\",\"\",Facility_Information!B83)","v":""},{"$f":"IF(Table5[[#This Row],[Company]]=\"\",\"\",MAX(B$1:B60)+1)","v":""},"",null,null,null,"bulk gasoline plant < 4,000 gallons/day, gasoline throughput"]
[{"$f":"IF(Facility_Information!B84=\"\",\"\",Facility_Information!B84)","v":""},{"$f":"IF(Table5[[#This Row],[Company]]=\"\",\"\",MAX(B$1:B61)+1)","v":""},"",null,null,null,"bulk gasoline plant ≥ 4,000 gallons/day, gasoline throughput "]
[{"$f":"IF(Facility_Information!B85=\"\",\"\",Facility_Information!B85)","v":""},{"$f":"IF(Table5[[#This Row],[Company]]=\"\",\"\",MAX(B$1:B62)+1)","v":""},"",null,null,null,"bulk gasoline terminal < 250,000 gallons/day, gasoline throughput (total of all racks) "]
[{"$f":"IF(Facility_Information!B86=\"\",\"\",Facility_Information!B86)","v":""},{"$f":"IF(Table5[[#This Row],[Company]]=\"\",\"\",MAX(B$1:B63)+1)","v":""},"",null,null,null,"bulk gasoline terminal ≥ 250,000 gallons/day, gasoline throughput (total of all racks) "]
[{"$f":"IF(Facility_Information!B87=\"\",\"\",Facility_Information!B87)","v":""},{"$f":"IF(Table5[[#This Row],[Company]]=\"\",\"\",MAX(B$1:B64)+1)","v":""},"",null,null,null,"pipeline pumping station"]
[{"$f":"IF(Facility_Information!B88=\"\",\"\",Facility_Information!B88)","v":""},{"$f":"IF(Table5[[#This Row],[Company]]=\"\",\"\",MAX(B$1:B65)+1)","v":""},{"$f":"+IFERROR(INDEX($A$2:$A$190,MATCH(ROW()-ROW($C$1),$B$2:$B$190,0)),\"\")","v":""}]
[{"$f":"IF(Facility_Information!B89=\"\",\"\",Facility_Information!B89)","v":""},{"$f":"IF(Table5[[#This Row],[Company]]=\"\",\"\",MAX(B$1:B66)+1)","v":""},"",null,null,null,"Subject Regulations"]
[{"$f":"IF(Facility_Information!B90=\"\",\"\",Facility_Information!B90)","v":""},{"$f":"IF(Table5[[#This Row],[Company]]=\"\",\"\",MAX(B$1:B67)+1)","v":""},"",null,null,null,"NSPS XXa and NESHAP R"]
[{"$f":"IF(Facility_Information!B91=\"\",\"\",Facility_Information!B91)","v":""},{"$f":"IF(Table5[[#This Row],[Company]]=\"\",\"\",MAX(B$1:B68)+1)","v":""},"",null,null,null,"NSPS XXa and NESHAP 6B"]
[{"$f":"IF(Facility_Information!B92=\"\",\"\",Facility_Information!B92)","v":""},{"$f":"IF(Table5[[#This Row],[Company]]=\"\",\"\",MAX(B$1:B69)+1)","v":""},"",null,null,null,"NESHAP R only"]
[{"$f":"IF(Facility_Information!B93=\"\",\"\",Facility_Information!B93)","v":""},{"$f":"IF(Table5[[#This Row],[Company]]=\"\",\"\",MAX(B$1:B70)+1)","v":""},"",null,null,null,"NESHAP 6B only"]
[{"$f":"IF(Facility_Information!B94=\"\",\"\",Facility_Information!B94)","v":""},{"$f":"IF(Table5[[#This Row],[Company]]=\"\",\"\",MAX(B$1:B71)+1)","v":""},""]
[{"$f":"IF(Facility_Information!B95=\"\",\"\",Facility_Information!B95)","v":""},{"$f":"IF(Table5[[#This Row],[Company]]=\"\",\"\",MAX(B$1:B72)+1)","v":""},"",null,null,null,"Delay of Repair Reason"]
[{"$f":"IF(Facility_Information!B96=\"\",\"\",Facility_Information!B96)","v":""},{"$f":"IF(Table5[[#This Row],[Company]]=\"\",\"\",MAX(B$1:B73)+1)","v":""},"",null,null,null,"Replacement parts unavailable"]
[{"$f":"IF(Facility_Information!B97=\"\",\"\",Facility_Information!B97)","v":""},{"$f":"IF(Table5[[#This Row],[Company]]=\"\",\"\",MAX(B$1:B74)+1)","v":""},"",null,null,null,"Repeated repair attempts were unsuccessful"]
[{"$f":"IF(Facility_Information!B98=\"\",\"\",Facility_Information!B98)","v":""},{"$f":"IF(Table5[[#This Row],[Company]]=\"\",\"\",MAX(B$1:B75)+1)","v":""},"",null,null,null,"Repair cannot be made without process unit shutdown"]
[{"$f":"IF(Facility_Information!B99=\"\",\"\",Facility_Information!B99)","v":""},{"$f":"IF(Table5[[#This Row],[Company]]=\"\",\"\",MAX(B$1:B76)+1)","v":""},"",null,null,null,"Did not repair"]
[{"$f":"IF(Facility_Information!B100=\"\",\"\",Facility_Information!B100)","v":""},{"$f":"IF(Table5[[#This Row],[Company]]=\"\",\"\",MAX(B$1:B77)+1)","v":""},"",null,null,null,"Other (specify in next column)"]
[{"$f":"IF(Facility_Information!B101=\"\",\"\",Facility_Information!B101)","v":""},{"$f":"IF(Table5[[#This Row],[Company]]=\"\",\"\",MAX(B$1:B78)+1)","v":""},""]
[{"$f":"IF(Facility_Information!B102=\"\",\"\",Facility_Information!B102)","v":""},{"$f":"IF(Table5[[#This Row],[Company]]=\"\",\"\",MAX(B$1:B79)+1)","v":""},"",null,null,null,"LEL Resposne"]
[{"$f":"IF(Facility_Information!B103=\"\",\"\",Facility_Information!B103)","v":""},{"$f":"IF(Table5[[#This Row],[Company]]=\"\",\"\",MAX(B$1:B80)+1)","v":""},"",null,null,null,"Roof repaired"]
[{"$f":"IF(Facility_Information!B104=\"\",\"\",Facility_Information!B104)","v":""},{"$f":"IF(Table5[[#This Row],[Company]]=\"\",\"\",MAX(B$1:B81)+1)","v":""},"",null,null,null,"Roof replaced"]
[{"$f":"IF(Facility_Information!B105=\"\",\"\",Facility_Information!B105)","v":""},{"$f":"IF(Table5[[#This Row],[Company]]=\"\",\"\",MAX(B$1:B82)+1)","v":""},"",null,null,null,"Storage vessel taken out of service"]
[{"$f":"IF(Facility_Information!B106=\"\",\"\",Facility_Information!B106)","v":""},{"$f":"IF(Table5[[#This Row],[Company]]=\"\",\"\",MAX(B$1:B83)+1)","v":""},""]
[{"$f":"IF(Facility_Information!B107=\"\",\"\",Facility_Information!B107)","v":""},{"$f":"IF(Table5[[#This Row],[Company]]=\"\",\"\",MAX(B$1:B84)+1)","v":""},""]
[{"$f":"IF(Facility_Information!B108=\"\",\"\",Facility_Information!B108)","v":""},{"$f":"IF(Table5[[#This Row],[Company]]=\"\",\"\",MAX(B$1:B85)+1)","v":""},""]
[{"$f":"IF(Facility_Information!B109=\"\",\"\",Facility_Information!B109)","v":""},{"$f":"IF(Table5[[#This Row],[Company]]=\"\",\"\",MAX(B$1:B86)+1)","v":""},""]
[{"$f":"IF(Facility_Information!B110=\"\",\"\",Facility_Information!B110)","v":""},{"$f":"IF(Table5[[#This Row],[Company]]=\"\",\"\",MAX(B$1:B87)+1)","v":""},""]
[{"$f":"IF(Facility_Information!B111=\"\",\"\",Facility_Information!B111)","v":""},{"$f":"IF(Table5[[#This Row],[Company]]=\"\",\"\",MAX(B$1:B88)+1)","v":""},""]
[{"$f":"IF(Facility_Information!B112=\"\",\"\",Facility_Information!B112)","v":""},{"$f":"IF(Table5[[#This Row],[Company]]=\"\",\"\",MAX(B$1:B89)+1)","v":""},""]
[{"$f":"IF(Facility_Information!B113=\"\",\"\",Facility_Information!B113)","v":""},{"$f":"IF(Table5[[#This Row],[Company]]=\"\",\"\",MAX(B$1:B90)+1)","v":""},""]
[{"$f":"IF(Facility_Information!B114=\"\",\"\",Facility_Information!B114)","v":""},{"$f":"IF(Table5[[#This Row],[Company]]=\"\",\"\",MAX(B$1:B91)+1)","v":""},""]
[{"$f":"IF(Facility_Information!B115=\"\",\"\",Facility_Information!B115)","v":""},{"$f":"IF(Table5[[#This Row],[Company]]=\"\",\"\",MAX(B$1:B92)+1)","v":""},""]
[{"$f":"IF(Facility_Information!B116=\"\",\"\",Facility_Information!B116)","v":""},{"$f":"IF(Table5[[#This Row],[Company]]=\"\",\"\",MAX(B$1:B93)+1)","v":""},""]
[{"$f":"IF(Facility_Information!B117=\"\",\"\",Facility_Information!B117)","v":""},{"$f":"IF(Table5[[#This Row],[Company]]=\"\",\"\",MAX(B$1:B94)+1)","v":""},""]
[{"$f":"IF(Facility_Information!B118=\"\",\"\",Facility_Information!B118)","v":""},{"$f":"IF(Table5[[#This Row],[Company]]=\"\",\"\",MAX(B$1:B95)+1)","v":""},""]
[{"$f":"IF(Facility_Information!B119=\"\",\"\",Facility_Information!B119)","v":""},{"$f":"IF(Table5[[#This Row],[Company]]=\"\",\"\",MAX(B$1:B96)+1)","v":""},""]
[{"$f":"IF(Facility_Information!B120=\"\",\"\",Facility_Information!B120)","v":""},{"$f":"IF(Table5[[#This Row],[Company]]=\"\",\"\",MAX(B$1:B97)+1)","v":""},{"$f":"+IFERROR(INDEX($A$2:$A$190,MATCH(ROW()-ROW($C$1),$B$2:$B$190,0)),\"\")","v":""}]
[{"$f":"IF(Facility_Information!B121=\"\",\"\",Facility_Information!B121)","v":""},{"$f":"IF(Table5[[#This Row],[Company]]=\"\",\"\",MAX(B$1:B98)+1)","v":""},""]
[{"$f":"IF(Facility_Information!B122=\"\",\"\",Facility_Information!B122)","v":""},{"$f":"IF(Table5[[#This Row],[Company]]=\"\",\"\",MAX(B$1:B99)+1)","v":""},""]
[{"$f":"IF(Facility_Information!B123=\"\",\"\",Facility_Information!B123)","v":""},{"$f":"IF(Table5[[#This Row],[Company]]=\"\",\"\",MAX(B$1:B100)+1)","v":""},""]
[{"$f":"IF(Facility_Information!B124=\"\",\"\",Facility_Information!B124)","v":""},{"$f":"IF(Table5[[#This Row],[Company]]=\"\",\"\",MAX(B$1:B101)+1)","v":""},""]
[{"$f":"IF(Facility_Information!B125=\"\",\"\",Facility_Information!B125)","v":""},{"$f":"IF(Table5[[#This Row],[Company]]=\"\",\"\",MAX(B$1:B102)+1)","v":""},""]
[{"$f":"IF(Facility_Information!B126=\"\",\"\",Facility_Information!B126)","v":""},{"$f":"IF(Table5[[#This Row],[Company]]=\"\",\"\",MAX(B$1:B103)+1)","v":""},""]
[{"$f":"IF(Facility_Information!B127=\"\",\"\",Facility_Information!B127)","v":""},{"$f":"IF(Table5[[#This Row],[Company]]=\"\",\"\",MAX(B$1:B104)+1)","v":""},""]
[{"$f":"IF(Facility_Information!B128=\"\",\"\",Facility_Information!B128)","v":""},{"$f":"IF(Table5[[#This Row],[Company]]=\"\",\"\",MAX(B$1:B105)+1)","v":""},""]
[{"$f":"IF(Facility_Information!B129=\"\",\"\",Facility_Information!B129)","v":""},{"$f":"IF(Table5[[#This Row],[Company]]=\"\",\"\",MAX(B$1:B106)+1)","v":""},""]
[{"$f":"IF(Facility_Information!B130=\"\",\"\",Facility_Information!B130)","v":""},{"$f":"IF(Table5[[#This Row],[Company]]=\"\",\"\",MAX(B$1:B107)+1)","v":""},""]
[{"$f":"IF(Facility_Information!B131=\"\",\"\",Facility_Information!B131)","v":""},{"$f":"IF(Table5[[#This Row],[Company]]=\"\",\"\",MAX(B$1:B108)+1)","v":""},""]
[{"$f":"IF(Facility_Information!B132=\"\",\"\",Facility_Information!B132)","v":""},{"$f":"IF(Table5[[#This Row],[Company]]=\"\",\"\",MAX(B$1:B109)+1)","v":""},""]
[{"$f":"IF(Facility_Information!B133=\"\",\"\",Facility_Information!B133)","v":""},{"$f":"IF(Table5[[#This Row],[Company]]=\"\",\"\",MAX(B$1:B110)+1)","v":""},""]
[{"$f":"IF(Facility_Information!B134=\"\",\"\",Facility_Information!B134)","v":""},{"$f":"IF(Table5[[#This Row],[Company]]=\"\",\"\",MAX(B$1:B111)+1)","v":""},""]
[{"$f":"IF(Facility_Information!B135=\"\",\"\",Facility_Information!B135)","v":""},{"$f":"IF(Table5[[#This Row],[Company]]=\"\",\"\",MAX(B$1:B112)+1)","v":""},""]
[{"$f":"IF(Facility_Information!B136=\"\",\"\",Facility_Information!B136)","v":""},{"$f":"IF(Table5[[#This Row],[Company]]=\"\",\"\",MAX(B$1:B113)+1)","v":""},""]
[{"$f":"IF(Facility_Information!B137=\"\",\"\",Facility_Information!B137)","v":""},{"$f":"IF(Table5[[#This Row],[Company]]=\"\",\"\",MAX(B$1:B114)+1)","v":""},""]
[{"$f":"IF(Facility_Information!B138=\"\",\"\",Facility_Information!B138)","v":""},{"$f":"IF(Table5[[#This Row],[Company]]=\"\",\"\",MAX(B$1:B115)+1)","v":""},""]
[{"$f":"IF(Facility_Information!B139=\"\",\"\",Facility_Information!B139)","v":""},{"$f":"IF(Table5[[#This Row],[Company]]=\"\",\"\",MAX(B$1:B116)+1)","v":""},""]
[{"$f":"IF(Facility_Information!B140=\"\",\"\",Facility_Information!B140)","v":""},{"$f":"IF(Table5[[#This Row],[Company]]=\"\",\"\",MAX(B$1:B117)+1)","v":""},""]
[{"$f":"IF(Facility_Information!B141=\"\",\"\",Facility_Information!B141)","v":""},{"$f":"IF(Table5[[#This Row],[Company]]=\"\",\"\",MAX(B$1:B118)+1)","v":""},""]
[{"$f":"IF(Facility_Information!B142=\"\",\"\",Facility_Information!B142)","v":""},{"$f":"IF(Table5[[#This Row],[Company]]=\"\",\"\",MAX(B$1:B119)+1)","v":""},""]
[{"$f":"IF(Facility_Information!B143=\"\",\"\",Facility_Information!B143)","v":""},{"$f":"IF(Table5[[#This Row],[Company]]=\"\",\"\",MAX(B$1:B120)+1)","v":""},""]
[{"$f":"IF(Facility_Information!B144=\"\",\"\",Facility_Information!B144)","v":""},{"$f":"IF(Table5[[#This Row],[Company]]=\"\",\"\",MAX(B$1:B121)+1)","v":""},""]
[{"$f":"IF(Facility_Information!B145=\"\",\"\",Facility_Information!B145)","v":""},{"$f":"IF(Table5[[#This Row],[Company]]=\"\",\"\",MAX(B$1:B122)+1)","v":""},""]
[{"$f":"IF(Facility_Information!B146=\"\",\"\",Facility_Information!B146)","v":""},{"$f":"IF(Table5[[#This Row],[Company]]=\"\",\"\",MAX(B$1:B123)+1)","v":""},""]
[{"$f":"IF(Facility_Information!B147=\"\",\"\",Facility_Information!B147)","v":""},{"$f":"IF(Table5[[#This Row],[Company]]=\"\",\"\",MAX(B$1:B124)+1)","v":""},""]
[{"$f":"IF(Facility_Information!B148=\"\",\"\",Facility_Information!B148)","v":""},{"$f":"IF(Table5[[#This Row],[Company]]=\"\",\"\",MAX(B$1:B125)+1)","v":""},""]
[{"$f":"IF(Facility_Information!B149=\"\",\"\",Facility_Information!B149)","v":""},{"$f":"IF(Table5[[#This Row],[Company]]=\"\",\"\",MAX(B$1:B126)+1)","v":""},""]
[{"$f":"IF(Facility_Information!B150=\"\",\"\",Facility_Information!B150)","v":""},{"$f":"IF(Table5[[#This Row],[Company]]=\"\",\"\",MAX(B$1:B127)+1)","v":""},""]
[{"$f":"IF(Facility_Information!B151=\"\",\"\",Facility_Information!B151)","v":""},{"$f":"IF(Table5[[#This Row],[Company]]=\"\",\"\",MAX(B$1:B128)+1)","v":""},""]
[{"$f":"IF(Facility_Information!B152=\"\",\"\",Facility_Information!B152)","v":""},{"$f":"IF(Table5[[#This Row],[Company]]=\"\",\"\",MAX(B$1:B129)+1)","v":""},{"$f":"+IFERROR(INDEX($A$2:$A$190,MATCH(ROW()-ROW($C$1),$B$2:$B$190,0)),\"\")","v":""}]
[{"$f":"IF(Facility_Information!B153=\"\",\"\",Facility_Information!B153)","v":""},{"$f":"IF(Table5[[#This Row],[Company]]=\"\",\"\",MAX(B$1:B130)+1)","v":""},""]
[{"$f":"IF(Facility_Information!B154=\"\",\"\",Facility_Information!B154)","v":""},{"$f":"IF(Table5[[#This Row],[Company]]=\"\",\"\",MAX(B$1:B131)+1)","v":""},""]
[{"$f":"IF(Facility_Information!B155=\"\",\"\",Facility_Information!B155)","v":""},{"$f":"IF(Table5[[#This Row],[Company]]=\"\",\"\",MAX(B$1:B132)+1)","v":""},""]
[{"$f":"IF(Facility_Information!B156=\"\",\"\",Facility_Information!B156)","v":""},{"$f":"IF(Table5[[#This Row],[Company]]=\"\",\"\",MAX(B$1:B133)+1)","v":""},""]
[{"$f":"IF(Facility_Information!B157=\"\",\"\",Facility_Information!B157)","v":""},{"$f":"IF(Table5[[#This Row],[Company]]=\"\",\"\",MAX(B$1:B134)+1)","v":""},""]
[{"$f":"IF(Facility_Information!B158=\"\",\"\",Facility_Information!B158)","v":""},{"$f":"IF(Table5[[#This Row],[Company]]=\"\",\"\",MAX(B$1:B135)+1)","v":""},""]
[{"$f":"IF(Facility_Information!B159=\"\",\"\",Facility_Information!B159)","v":""},{"$f":"IF(Table5[[#This Row],[Company]]=\"\",\"\",MAX(B$1:B136)+1)","v":""},""]
[{"$f":"IF(Facility_Information!B160=\"\",\"\",Facility_Information!B160)","v":""},{"$f":"IF(Table5[[#This Row],[Company]]=\"\",\"\",MAX(B$1:B137)+1)","v":""},""]
[{"$f":"IF(Facility_Information!B161=\"\",\"\",Facility_Information!B161)","v":""},{"$f":"IF(Table5[[#This Row],[Company]]=\"\",\"\",MAX(B$1:B138)+1)","v":""},""]
[{"$f":"IF(Facility_Information!B162=\"\",\"\",Facility_Information!B162)","v":""},{"$f":"IF(Table5[[#This Row],[Company]]=\"\",\"\",MAX(B$1:B139)+1)","v":""},""]
[{"$f":"IF(Facility_Information!B163=\"\",\"\",Facility_Information!B163)","v":""},{"$f":"IF(Table5[[#This Row],[Company]]=\"\",\"\",MAX(B$1:B140)+1)","v":""},""]
[{"$f":"IF(Facility_Information!B164=\"\",\"\",Facility_Information!B164)","v":""},{"$f":"IF(Table5[[#This Row],[Company]]=\"\",\"\",MAX(B$1:B141)+1)","v":""},""]
[{"$f":"IF(Facility_Information!B165=\"\",\"\",Facility_Information!B165)","v":""},{"$f":"IF(Table5[[#This Row],[Company]]=\"\",\"\",MAX(B$1:B142)+1)","v":""},""]
[{"$f":"IF(Facility_Information!B166=\"\",\"\",Facility_Information!B166)","v":""},{"$f":"IF(Table5[[#This Row],[Company]]=\"\",\"\",MAX(B$1:B143)+1)","v":""},""]
[{"$f":"IF(Facility_Information!B167=\"\",\"\",Facility_Information!B167)","v":""},{"$f":"IF(Table5[[#This Row],[Company]]=\"\",\"\",MAX(B$1:B144)+1)","v":""},""]
[{"$f":"IF(Facility_Information!B168=\"\",\"\",Facility_Information!B168)","v":""},{"$f":"IF(Table5[[#This Row],[Company]]=\"\",\"\",MAX(B$1:B145)+1)","v":""},""]
[{"$f":"IF(Facility_Information!B169=\"\",\"\",Facility_Information!B169)","v":""},{"$f":"IF(Table5[[#This Row],[Company]]=\"\",\"\",MAX(B$1:B146)+1)","v":""},""]
[{"$f":"IF(Facility_Information!B170=\"\",\"\",Facility_Information!B170)","v":""},{"$f":"IF(Table5[[#This Row],[Company]]=\"\",\"\",MAX(B$1:B147)+1)","v":""},""]
[{"$f":"IF(Facility_Information!B171=\"\",\"\",Facility_Information!B171)","v":""},{"$f":"IF(Table5[[#This Row],[Company]]=\"\",\"\",MAX(B$1:B148)+1)","v":""},""]
[{"$f":"IF(Facility_Information!B172=\"\",\"\",Facility_Information!B172)","v":""},{"$f":"IF(Table5[[#This Row],[Company]]=\"\",\"\",MAX(B$1:B149)+1)","v":""},""]
[{"$f":"IF(Facility_Information!B173=\"\",\"\",Facility_Information!B173)","v":""},{"$f":"IF(Table5[[#This Row],[Company]]=\"\",\"\",MAX(B$1:B150)+1)","v":""},""]
[{"$f":"IF(Facility_Information!B174=\"\",\"\",Facility_Information!B174)","v":""},{"$f":"IF(Table5[[#This Row],[Company]]=\"\",\"\",MAX(B$1:B151)+1)","v":""},""]
[{"$f":"IF(Facility_Information!B175=\"\",\"\",Facility_Information!B175)","v":""},{"$f":"IF(Table5[[#This Row],[Company]]=\"\",\"\",MAX(B$1:B152)+1)","v":""},""]
[{"$f":"IF(Facility_Information!B176=\"\",\"\",Facility_Information!B176)","v":""},{"$f":"IF(Table5[[#This Row],[Company]]=\"\",\"\",MAX(B$1:B153)+1)","v":""},""]
[{"$f":"IF(Facility_Information!B177=\"\",\"\",Facility_Information!B177)","v":""},{"$f":"IF(Table5[[#This Row],[Company]]=\"\",\"\",MAX(B$1:B154)+1)","v":""},""]
[{"$f":"IF(Facility_Information!B178=\"\",\"\",Facility_Information!B178)","v":""},{"$f":"IF(Table5[[#This Row],[Company]]=\"\",\"\",MAX(B$1:B155)+1)","v":""},""]
[{"$f":"IF(Facility_Information!B179=\"\",\"\",Facility_Information!B179)","v":""},{"$f":"IF(Table5[[#This Row],[Company]]=\"\",\"\",MAX(B$1:B156)+1)","v":""},""]
[{"$f":"IF(Facility_Information!B180=\"\",\"\",Facility_Information!B180)","v":""},{"$f":"IF(Table5[[#This Row],[Company]]=\"\",\"\",MAX(B$1:B157)+1)","v":""},""]
[{"$f":"IF(Facility_Information!B181=\"\",\"\",Facility_Information!B181)","v":""},{"$f":"IF(Table5[[#This Row],[Company]]=\"\",\"\",MAX(B$1:B158)+1)","v":""},""]
[{"$f":"IF(Facility_Information!B182=\"\",\"\",Facility_Information!B182)","v":""},{"$f":"IF(Table5[[#This Row],[Company]]=\"\",\"\",MAX(B$1:B159)+1)","v":""},""]
[{"$f":"IF(Facility_Information!B183=\"\",\"\",Facility_Information!B183)","v":""},{"$f":"IF(Table5[[#This Row],[Company]]=\"\",\"\",MAX(B$1:B160)+1)","v":""},""]
[{"$f":"IF(Facility_Information!B184=\"\",\"\",Facility_Information!B184)","v":""},{"$f":"IF(Table5[[#This Row],[Company]]=\"\",\"\",MAX(B$1:B161)+1)","v":""},{"$f":"+IFERROR(INDEX($A$2:$A$190,MATCH(ROW()-ROW($C$1),$B$2:$B$190,0)),\"\")","v":""}]
[{"$f":"IF(Facility_Information!B185=\"\",\"\",Facility_Information!B185)","v":""},{"$f":"IF(Table5[[#This Row],[Company]]=\"\",\"\",MAX(B$1:B162)+1)","v":""},""]
[{"$f":"IF(Facility_Information!B186=\"\",\"\",Facility_Information!B186)","v":""},{"$f":"IF(Table5[[#This Row],[Company]]=\"\",\"\",MAX(B$1:B163)+1)","v":""},""]
[{"$f":"IF(Facility_Information!B187=\"\",\"\",Facility_Information!B187)","v":""},{"$f":"IF(Table5[[#This Row],[Company]]=\"\",\"\",MAX(B$1:B164)+1)","v":""},""]
[{"$f":"IF(Facility_Information!B188=\"\",\"\",Facility_Information!B188)","v":""},{"$f":"IF(Table5[[#This Row],[Company]]=\"\",\"\",MAX(B$1:B165)+1)","v":""},""]
[{"$f":"IF(Facility_Information!B189=\"\",\"\",Facility_Information!B189)","v":""},{"$f":"IF(Table5[[#This Row],[Company]]=\"\",\"\",MAX(B$1:B166)+1)","v":""},""]
[{"$f":"IF(Facility_Information!B190=\"\",\"\",Facility_Information!B190)","v":""},{"$f":"IF(Table5[[#This Row],[Company]]=\"\",\"\",MAX(B$1:B167)+1)","v":""},""]
[{"$f":"IF(Facility_Information!B191=\"\",\"\",Facility_Information!B191)","v":""},{"$f":"IF(Table5[[#This Row],[Company]]=\"\",\"\",MAX(B$1:B168)+1)","v":""},""]
[{"$f":"IF(Facility_Information!B192=\"\",\"\",Facility_Information!B192)","v":""},{"$f":"IF(Table5[[#This Row],[Company]]=\"\",\"\",MAX(B$1:B169)+1)","v":""},""]
[{"$f":"IF(Facility_Information!B193=\"\",\"\",Facility_Information!B193)","v":""},{"$f":"IF(Table5[[#This Row],[Company]]=\"\",\"\",MAX(B$1:B170)+1)","v":""},""]
[{"$f":"IF(Facility_Information!B194=\"\",\"\",Facility_Information!B194)","v":""},{"$f":"IF(Table5[[#This Row],[Company]]=\"\",\"\",MAX(B$1:B171)+1)","v":""},""]
[{"$f":"IF(Facility_Information!B195=\"\",\"\",Facility_Information!B195)","v":""},{"$f":"IF(Table5[[#This Row],[Company]]=\"\",\"\",MAX(B$1:B172)+1)","v":""},""]
[{"$f":"IF(Facility_Information!B196=\"\",\"\",Facility_Information!B196)","v":""},{"$f":"IF(Table5[[#This Row],[Company]]=\"\",\"\",MAX(B$1:B173)+1)","v":""},""]
[{"$f":"IF(Facility_Information!B197=\"\",\"\",Facility_Information!B197)","v":""},{"$f":"IF(Table5[[#This Row],[Company]]=\"\",\"\",MAX(B$1:B174)+1)","v":""},""]
[{"$f":"IF(Facility_Information!B198=\"\",\"\",Facility_Information!B198)","v":""},{"$f":"IF(Table5[[#This Row],[Company]]=\"\",\"\",MAX(B$1:B175)+1)","v":""},""]
[{"$f":"IF(Facility_Information!B199=\"\",\"\",Facility_Information!B199)","v":""},{"$f":"IF(Table5[[#This Row],[Company]]=\"\",\"\",MAX(B$1:B176)+1)","v":""},""]
[{"$f":"IF(Facility_Information!B200=\"\",\"\",Facility_Information!B200)","v":""},{"$f":"IF(Table5[[#This Row],[Company]]=\"\",\"\",MAX(B$1:B177)+1)","v":""},""]
[{"$f":"IF(Facility_Information!B201=\"\",\"\",Facility_Information!B201)","v":""},{"$f":"IF(Table5[[#This Row],[Company]]=\"\",\"\",MAX(B$1:B178)+1)","v":""},""]
[{"$f":"IF(Facility_Information!B202=\"\",\"\",Facility_Information!B202)","v":""},{"$f":"IF(Table5[[#This Row],[Company]]=\"\",\"\",MAX(B$1:B179)+1)","v":""},""]
[{"$f":"IF(Facility_Information!B203=\"\",\"\",Facility_Information!B203)","v":""},{"$f":"IF(Table5[[#This Row],[Company]]=\"\",\"\",MAX(B$1:B180)+1)","v":""},""]
[{"$f":"IF(Facility_Information!B204=\"\",\"\",Facility_Information!B204)","v":""},{"$f":"IF(Table5[[#This Row],[Company]]=\"\",\"\",MAX(B$1:B181)+1)","v":""},""]
[{"$f":"IF(Facility_Information!B205=\"\",\"\",Facility_Information!B205)","v":""},{"$f":"IF(Table5[[#This Row],[Company]]=\"\",\"\",MAX(B$1:B182)+1)","v":""},""]
[{"$f":"IF(Facility_Information!B206=\"\",\"\",Facility_Information!B206)","v":""},{"$f":"IF(Table5[[#This Row],[Company]]=\"\",\"\",MAX(B$1:B183)+1)","v":""},""]
[{"$f":"IF(Facility_Information!B207=\"\",\"\",Facility_Information!B207)","v":""},{"$f":"IF(Table5[[#This Row],[Company]]=\"\",\"\",MAX(B$1:B184)+1)","v":""},""]
[{"$f":"IF(Facility_Information!B208=\"\",\"\",Facility_Information!B208)","v":""},{"$f":"IF(Table5[[#This Row],[Company]]=\"\",\"\",MAX(B$1:B185)+1)","v":""},""]
[{"$f":"IF(Facility_Information!B209=\"\",\"\",Facility_Information!B209)","v":""},{"$f":"IF(Table5[[#This Row],[Company]]=\"\",\"\",MAX(B$1:B186)+1)","v":""},""]
[{"$f":"IF(Facility_Information!B210=\"\",\"\",Facility_Information!B210)","v":""},{"$f":"IF(Table5[[#This Row],[Company]]=\"\",\"\",MAX(B$1:B187)+1)","v":""},""]
[{"$f":"IF(Facility_Information!B211=\"\",\"\",Facility_Information!B211)","v":""},{"$f":"IF(Table5[[#This Row],[Company]]=\"\",\"\",MAX(B$1:B188)+1)","v":""},""]
[{"$f":"IF(Facility_Information!B212=\"\",\"\",Facility_Information!B212)","v":""},{"$f":"IF(Table5[[#This Row],[Company]]=\"\",\"\",MAX(B$1:B190)+1)","v":""},""]
[{"$f":"IF(Facility_Information!B213=\"\",\"\",Facility_Information!B213)","v":""},null,""]
[{"$f":"IF(Facility_Information!B214=\"\",\"\",Facility_Information!B214)","v":""},null,""]
[{"$f":"IF(Facility_Information!B215=\"\",\"\",Facility_Information!B215)","v":""},null,""]
[{"$f":"IF(Facility_Information!B216=\"\",\"\",Facility_Information!B216)","v":""},null,{"$f":"+IFERROR(INDEX($A$2:$A$190,MATCH(ROW()-ROW($C$1),$B$2:$B$190,0)),\"\")","v":""}]
[{"$f":"IF(Facility_Information!B217=\"\",\"\",Facility_Information!B217)","v":""},null,""]
[{"$f":"IF(Facility_Information!B218=\"\",\"\",Facility_Information!B218)","v":""},null,""]
[{"$f":"IF(Facility_Information!B219=\"\",\"\",Facility_Information!B219)","v":""},null,""]
[{"$f":"IF(Facility_Information!B220=\"\",\"\",Facility_Information!B220)","v":""},null,""]
[{"$f":"IF(Facility_Information!B221=\"\",\"\",Facility_Information!B221)","v":""},null,""]
[{"$f":"IF(Facility_Information!B222=\"\",\"\",Facility_Information!B222)","v":""},null,""]
[{"$f":"IF(Facility_Information!B223=\"\",\"\",Facility_Information!B223)","v":""},null,""]