{"text_format":"2","workbook":"xlsx","n_sheets":14,"sheets":["Welcome","Facility_Information","General_Information","CMS_Deviation_Outage","Flares","Vapor_Tightness","Vapor_Collection","Monitored_Leaks","AVO_Leaks","Delay_of_Repair","LEL","Revisions","Worksheet Map","Lists"],"not_rendered":{"charts":0,"images":1,"macros":0,"external_links":0,"defined_names":2,"comments":0,"pivot_tables":0},"unopened":[],"bounds":{"document_bytes":16777216,"sheet_cells":100000,"run_cost":"one","rows_first":2000,"rows_last":500,"rows_between":2000,"halvings":0,"cell_chars":16384,"cell_head_chars":4096},"cells_cut":0,"cells_raw":0,"read":"whole","date_system":"1900"}

{"sheet":"Welcome","index":0,"n_rows":21,"n_cols":2,"rows_kept":21,"cut":false,"hidden":false,"merged":[]}
["DO NOT REMOVE OR EDIT INFORMATION IN ROWS 1 THROUGH 5\nFOR INTERNAL USE ONLY"]
["Template Name","Gasoline Distribution Semiannual Reports (Spreadsheet Template)"]
["CitationID","60.505a(c)"]
["Template Version","draft"]
["Last Updated Date","2023-09-28"]
[null,"OMB Control Numbers: 2060-xxxx (40 CFR Part 60, Subpart XXa); 2060-0325 (40 CFR Part 63, Subpart R); 2060-0620 (40 CFR Part 63, Subpart 6B)\nForm 5900-579\nFor further Paperwork Reduction Act information see: \nhttps://www.epa.gov/electronic-reporting-air-emissions/paperwork-reduction-act-pra-cedri-and-ert"]
[null,"40 CFR Part 60, Subpart XXa Standards of Performance for Bulk Gasoline Terminals\n40 CFR Part 63, Subpart R National Emission Standards for Gasoline Distribution Facilities (Bulk Gasoline Terminals and Pipeline Breakout Stations)\n40 CFR Part 63, Subpart BBBBBB National Emission Standards for Hazardous Air Pollutants for Source Category: Gasoline Distribution Bulk Terminals, Bulk Plants, and Pipeline Facilities"]
[null,"§60.505a(c), §63.428(m), and §63.11095(d) Semiannual Report Spreadsheet Template"]
[null,"Instructions for Spreadsheet Template"]
[null,"Purpose:"]
{"$rows_left_out":12}
{"sheet":"Facility_Information","index":1,"n_rows":212,"n_cols":24,"rows_kept":212,"cut":false,"hidden":false,"merged":[]}
[null,"DO NOT REMOVE OR EDIT INFORMATION IN ROWS 1 THROUGH 5\nFOR INTERNAL USE ONLY"]
[null,"Template Name",{"$f":"Welcome!B2","v":"Gasoline Distribution Semiannual Reports (Spreadsheet Template)"}]
[null,"CitationID",{"$f":"Welcome!B3","v":"60.505a(c)"}]
[null,"Template Version",{"$f":"Welcome!B4","v":"draft"}]
[null,"Last Updated Date",{"$f":"Welcome!B5","v":"2023-09-28"}]
[]
[null,"40 CFR Part 60, Subpart XXa, 40 CFR Part 63, Subpart R, 40 CFR Part 63, Subpart BBBBBB - Gasoline Distribution"]
[null,"§60.505a(c), §63.428(m), and §63.11095(d) Semiannual  Report Spreadsheet Template"]
[null,"This tab includes information on the site(s) for which you are reporting and the reporting period."]
[]
{"$rows_left_out":203}
{"sheet":"General_Information","index":2,"n_rows":212,"n_cols":8,"rows_kept":212,"cut":false,"hidden":false,"merged":[]}
[null,"DO NOT REMOVE OR EDIT INFORMATION IN ROWS 1 THROUGH 5\nFOR INTERNAL USE ONLY"]
[null,"Template Name",{"$f":"Welcome!B2","v":"Gasoline Distribution Semiannual Reports (Spreadsheet Template)"}]
[null,"CitationID",{"$f":"Welcome!B3","v":"60.505a(c)"}]
[null,"Template Version",{"$f":"Welcome!B4","v":"draft"}]
[null,"Last Updated Date",{"$f":"Welcome!B5","v":"2023-09-28"}]
[]
[null,{"$f":"Facility_Information!B7","v":"40 CFR Part 60, Subpart XXa, 40 CFR Part 63, Subpart R, 40 CFR Part 63, Subpart BBBBBB - Gasoline Distribution"}]
[null,{"$f":"Facility_Information!B8","v":"§60.505a(c), §63.428(m), and §63.11095(d) Semiannual  Report Spreadsheet Template"}]
[null,"This worksheet contains general information and general declarations about each site. "]
[null,"Note: Facility Record No. appears automatically once a Facility(s) is added to the Facility_Information worksheet."]
{"$rows_left_out":203}
{"sheet":"CMS_Deviation_Outage","index":3,"n_rows":23,"n_cols":19,"rows_kept":23,"cut":false,"hidden":false,"merged":[]}
[null,"DO NOT REMOVE OR EDIT INFORMATION IN ROWS 1 THROUGH 5\nFOR INTERNAL USE ONLY"]
[null,"Template Name",{"$f":"Welcome!B2","v":"Gasoline Distribution Semiannual Reports (Spreadsheet Template)"}]
[null,"CitationID",{"$f":"Welcome!B3","v":"60.505a(c)"}]
[null,"Template Version",{"$f":"Welcome!B4","v":"draft"}]
[null,"Last Updated Date",{"$f":"Welcome!B5","v":"2023-09-28"}]
[]
[null,{"$f":"Facility_Information!B7","v":"40 CFR Part 60, Subpart XXa, 40 CFR Part 63, Subpart R, 40 CFR Part 63, Subpart BBBBBB - Gasoline Distribution"}]
[null,{"$f":"Facility_Information!B8","v":"§60.505a(c), §63.428(m), and §63.11095(d) Semiannual  Report Spreadsheet Template"}]
[]
[null,"Note: Facility Record No. selections appear once a Facility(s) is added to Facility_Information worksheet. This tab is used to report periods when a CEMS or CPMS is out-of-control or nonoperational or when a deviation from an operating limit or concentration limit has occurred."]
{"$rows_left_out":14}
{"sheet":"Flares","index":4,"n_rows":5023,"n_cols":25,"rows_kept":5023,"cut":false,"hidden":false,"merged":[]}
[null,"DO NOT REMOVE OR EDIT INFORMATION IN ROWS 1 THROUGH 5\nFOR INTERNAL USE ONLY"]
[null,{"$f":"Welcome!A2","v":"Template Name"},{"$f":"Welcome!B2","v":"Gasoline Distribution Semiannual Reports (Spreadsheet Template)"}]
[null,{"$f":"Welcome!A3","v":"CitationID"},{"$f":"Welcome!B3","v":"60.505a(c)"}]
[null,{"$f":"Welcome!A4","v":"Template Version"},{"$f":"Welcome!B4","v":"draft"}]
[null,{"$f":"Welcome!A5","v":"Last Updated Date"},{"$f":"Welcome!B5","v":"2023-09-28"}]
[]
[null,{"$f":"Facility_Information!B7","v":"40 CFR Part 60, Subpart XXa, 40 CFR Part 63, Subpart R, 40 CFR Part 63, Subpart BBBBBB - Gasoline Distribution"}]
[null,{"$f":"Facility_Information!B8","v":"§60.505a(c), §63.428(m), and §63.11095(d) Semiannual  Report Spreadsheet Template"}]
[]
[null,"Note: Facility Record No. selections appear once a Facility(s) is added to Facility_Information worksheet. Columns I-Y will be blacked out depending on the answers provided in Column D."]
{"$rows_left_out":5014}
{"sheet":"Vapor_Tightness","index":5,"n_rows":23,"n_cols":12,"rows_kept":23,"cut":false,"hidden":false,"merged":[]}
[null,"DO NOT REMOVE OR EDIT INFORMATION IN ROWS 1 THROUGH 5\nFOR INTERNAL USE ONLY"]
[null,{"$f":"Welcome!A2","v":"Template Name"},{"$f":"Welcome!B2","v":"Gasoline Distribution Semiannual Reports (Spreadsheet Template)"}]
[null,{"$f":"Welcome!A3","v":"CitationID"},{"$f":"Welcome!B3","v":"60.505a(c)"}]
[null,{"$f":"Welcome!A4","v":"Template Version"},{"$f":"Welcome!B4","v":"draft"}]
[null,{"$f":"Welcome!A5","v":"Last Updated Date"},{"$f":"Welcome!B5","v":"2023-09-28"}]
[]
[null,{"$f":"Facility_Information!B7","v":"40 CFR Part 60, Subpart XXa, 40 CFR Part 63, Subpart R, 40 CFR Part 63, Subpart BBBBBB - Gasoline Distribution"}]
[null,{"$f":"Facility_Information!B8","v":"§60.505a(c), §63.428(m), and §63.11095(d) Semiannual  Report Spreadsheet Template"}]
[]
[null,"Use this worksheet to report any instance in which liquid product was loaded into a cargo tank for which vapor tightness documentation required under §60.502a(e)(1) or §63.11094(b) was not provided or available in the terminal’s records."]
{"$rows_left_out":14}
{"sheet":"Vapor_Collection","index":6,"n_rows":23,"n_cols":7,"rows_kept":23,"cut":false,"hidden":false,"merged":[]}
[null,"DO NOT REMOVE OR EDIT INFORMATION IN ROWS 1 THROUGH 5\nFOR INTERNAL USE ONLY"]
[null,{"$f":"Welcome!A2","v":"Template Name"},{"$f":"Welcome!B2","v":"Gasoline Distribution Semiannual Reports (Spreadsheet Template)"}]
[null,{"$f":"Welcome!A3","v":"CitationID"},{"$f":"Welcome!B3","v":"60.505a(c)"}]
[null,{"$f":"Welcome!A4","v":"Template Version"},{"$f":"Welcome!B4","v":"draft"}]
[null,{"$f":"Welcome!A5","v":"Last Updated Date"},{"$f":"Welcome!B5","v":"2023-09-28"}]
[]
[null,{"$f":"Facility_Information!B7","v":"40 CFR Part 60, Subpart XXa, 40 CFR Part 63, Subpart R, 40 CFR Part 63, Subpart BBBBBB - Gasoline Distribution"}]
[null,{"$f":"Facility_Information!B8","v":"§60.505a(c), §63.428(m), and §63.11095(d) Semiannual  Report Spreadsheet Template"}]
[null,"Use this worksheet to report each instance when:\n(1) liquid product was loaded into cargo tanks not using submerged filling, as defined in §60.501a, §63.421, or §63.11100; \n(2) liquid prodcut was loaded into cargo tanks that were not equipped with vapor collection equipment that is compatible with the terminal's vapor collection system; and \n(3) each instance liquid product was loaded into cargo tanks when the terminal's and the cargo tank's vapor collection systems were not properly connected."]
[null,"Use this worksheet to also report instances for 40 CFR part 63 subpart BBBBBB when gasoline was loaded between gasoline cargo tanks and storage tanks and the plant’s vapor balancing system was not properly connected between the gasoline cargo tank and storage tank."]
{"$rows_left_out":14}
{"sheet":"Monitored_Leaks","index":7,"n_rows":23,"n_cols":10,"rows_kept":23,"cut":false,"hidden":false,"merged":[]}
[null,"DO NOT REMOVE OR EDIT INFORMATION IN ROWS 1 THROUGH 5\nFOR INTERNAL USE ONLY"]
[null,{"$f":"Welcome!A2","v":"Template Name"},{"$f":"Welcome!B2","v":"Gasoline Distribution Semiannual Reports (Spreadsheet Template)"}]
[null,{"$f":"Welcome!A3","v":"CitationID"},{"$f":"Welcome!B3","v":"60.505a(c)"}]
[null,{"$f":"Welcome!A4","v":"Template Version"},{"$f":"Welcome!B4","v":"draft"}]
[null,{"$f":"Welcome!A5","v":"Last Updated Date"},{"$f":"Welcome!B5","v":"2023-09-28"}]
[]
[null,{"$f":"Facility_Information!B7","v":"40 CFR Part 60, Subpart XXa, 40 CFR Part 63, Subpart R, 40 CFR Part 63, Subpart BBBBBB - Gasoline Distribution"}]
[null,{"$f":"Facility_Information!B8","v":"§60.505a(c), §63.428(m), and §63.11095(d) Semiannual  Report Spreadsheet Template"}]
[null,"Use this worksheet to report information on leaks detected during a leak inspection required under §60.502a(j)(1), §60.503a(a)(2), §63.424(c), or §63.11089(c)."]
[null,"Note: Facility Record No. selections appear once a Facility(s) is added to the Facility_Information worksheet."]
{"$rows_left_out":14}
{"sheet":"AVO_Leaks","index":8,"n_rows":23,"n_cols":8,"rows_kept":23,"cut":false,"hidden":false,"merged":[]}
[null,"DO NOT REMOVE OR EDIT INFORMATION IN ROWS 1 THROUGH 5\nFOR INTERNAL USE ONLY"]
[null,{"$f":"Welcome!A2","v":"Template Name"},{"$f":"Welcome!B2","v":"Gasoline Distribution Semiannual Reports (Spreadsheet Template)"}]
[null,{"$f":"Welcome!A3","v":"CitationID"},{"$f":"Welcome!B3","v":"60.505a(c)"}]
[null,{"$f":"Welcome!A4","v":"Template Version"},{"$f":"Welcome!B4","v":"draft"}]
[null,{"$f":"Welcome!A5","v":"Last Updated Date"},{"$f":"Welcome!B5","v":"2023-09-28"}]
[]
[null,{"$f":"Facility_Information!B7","v":"40 CFR Part 60, Subpart XXa, 40 CFR Part 63, Subpart R, 40 CFR Part 63, Subpart BBBBBB - Gasoline Distribution"}]
[null,{"$f":"Facility_Information!B8","v":"§60.505a(c), §63.428(m), and §63.11095(d) Semiannual  Report Spreadsheet Template"}]
[null,"Use this worksheet to report leaks identified by audio, visual, or olfactory methods under §60.502a(j)(2), §63.424(c), or §63.11089(c)."]
[null,"Note: Facility Record No. selections appear once a Facility(s) is added to the Facility_Information worksheet."]
{"$rows_left_out":14}
{"sheet":"Delay_of_Repair","index":9,"n_rows":23,"n_cols":9,"rows_kept":23,"cut":false,"hidden":false,"merged":[]}
[null,"DO NOT REMOVE OR EDIT INFORMATION IN ROWS 1 THROUGH 5\nFOR INTERNAL USE ONLY"]
[null,"Template Name",{"$f":"Welcome!B2","v":"Gasoline Distribution Semiannual Reports (Spreadsheet Template)"}]
[null,"CitationID",{"$f":"Welcome!B3","v":"60.505a(c)"}]
[null,"Template Version",{"$f":"Welcome!B4","v":"draft"}]
[null,"Last Updated Date",{"$f":"Welcome!B5","v":"2023-09-28"}]
[]
[null,{"$f":"Facility_Information!B7","v":"40 CFR Part 60, Subpart XXa, 40 CFR Part 63, Subpart R, 40 CFR Part 63, Subpart BBBBBB - Gasoline Distribution"}]
[null,{"$f":"Facility_Information!B8","v":"§60.505a(c), §63.428(m), and §63.11095(d) Semiannual  Report Spreadsheet Template"}]
[null,"Use this worksheet to report information for each leak that was on the delay of repair list at any time during the reporting period."]
[null,"Note: Facility Record No. selections appear once a Facility(s) is added to the Facility_Information worksheet."]
{"$rows_left_out":14}
{"sheet":"LEL","index":10,"n_rows":23,"n_cols":10,"rows_kept":23,"cut":false,"hidden":false,"merged":[]}
[null,"DO NOT REMOVE OR EDIT INFORMATION IN ROWS 1 THROUGH 5\nFOR INTERNAL USE ONLY"]
[null,"Template Name",{"$f":"Welcome!B2","v":"Gasoline Distribution Semiannual Reports (Spreadsheet Template)"}]
[null,"CitationID",{"$f":"Welcome!B3","v":"60.505a(c)"}]
[null,"Template Version",{"$f":"Welcome!B4","v":"draft"}]
[null,"Last Updated Date",{"$f":"Welcome!B5","v":"2023-09-28"}]
[]
[null,{"$f":"Facility_Information!B7","v":"40 CFR Part 60, Subpart XXa, 40 CFR Part 63, Subpart R, 40 CFR Part 63, Subpart BBBBBB - Gasoline Distribution"}]
[null,{"$f":"Facility_Information!B8","v":"§60.505a(c), §63.428(m), and §63.11095(d) Semiannual  Report Spreadsheet Template"}]
[null,"Use this worksheet to report deviations in LEL monitoring if you are complying with §63.423(c)(2) or options 2(c) or 2(e) in Table 1 to 40 CFR part 63 subpart BBBBBB."]
[null,"Note: Facility Record No. selections appear once a Facility(s) is added to the Facility_Information worksheet."]
{"$rows_left_out":14}
{"sheet":"Revisions","index":11,"n_rows":2,"n_cols":3,"rows_kept":2,"cut":false,"hidden":false,"merged":[]}
["Revision Number","Date","Description"]
[1,null,"Finalized Release Version"]

{"sheet":"Worksheet Map","index":12,"n_rows":11,"n_cols":5,"rows_kept":11,"cut":false,"hidden":true,"merged":[]}
["Worksheet Name","Parent","JSON Key","Parent Primary Key","Child Foreign Key"]
["Facility_Information",null,"records"]
["General_Information","records","GeneralInformation","RecordId","RecordId"]
["CMS_Deviation_Outage","records","CMSDeviationOutage","RecordId","RecordId"]
["Flares","records","Flares","RecordId","RecordId"]
["Vapor_Tightness","records","VaporTightness","RecordId","RecordId"]
["Vapor_Collection","records","VaporCollection","RecordId","RecordId"]
["Monitored_Leaks","records","MonitoredLeaks","RecordId","RecordId"]
["AVO_Leaks","records","AVOLeaks","RecordId","RecordId"]
["Delay_of_Repair","records","DelayOfRepair","RecordId","RecordId"]
{"$rows_left_out":2}
{"sheet":"Lists","index":13,"n_rows":201,"n_cols":8,"rows_kept":201,"cut":false,"hidden":true,"merged":[]}
["Company","Number","Company List",null,"States",null,"Limit Units"]
[{"$f":"IF(SUMPRODUCT(--(LEN(Facility_Information!B24:B212)>0))>0,IF(Facility_Information!B24=\"\",\"\",Facility_Information!B24),\"Add a facility in the Facility Information tab\")","v":"Add a facility in the Facility Information tab"},{"$f":"IF(Table5[[#This Row],[Company]]=\"\",\"\",MAX(B1:B$1)+1)","v":1},{"$f":"+IFERROR(INDEX($A$2:$A$190,MATCH(ROW()-ROW($C$1),$B$2:$B$190,0)),\"\")","v":"Add a facility in the Facility Information tab"},null,"AK",null,"ppmv (excludes methane)"]
[{"$f":"IF(Facility_Information!B25=\"\",\"\",Facility_Information!B25)","v":""},{"$f":"IF(Table5[[#This Row],[Company]]=\"\",\"\",MAX(B$1:B2)+1)","v":""},"",null,"AL",null,"ppmv (includes methane)"]
[{"$f":"IF(Facility_Information!B26=\"\",\"\",Facility_Information!B26)","v":""},{"$f":"IF(Table5[[#This Row],[Company]]=\"\",\"\",MAX(B$1:B3)+1)","v":""},"",null,"AR",null,"° C"]
[{"$f":"IF(Facility_Information!B27=\"\",\"\",Facility_Information!B27)","v":""},{"$f":"IF(Table5[[#This Row],[Company]]=\"\",\"\",MAX(B$1:B4)+1)","v":""},"",null,"AS",null,"° F"]
[{"$f":"IF(Facility_Information!B28=\"\",\"\",Facility_Information!B28)","v":""},{"$f":"IF(Table5[[#This Row],[Company]]=\"\",\"\",MAX(B$1:B5)+1)","v":""},"",null,"AZ",null,"inches of water"]
[{"$f":"IF(Facility_Information!B29=\"\",\"\",Facility_Information!B29)","v":""},{"$f":"IF(Table5[[#This Row],[Company]]=\"\",\"\",MAX(B$1:B6)+1)","v":""},"",null,"CA",null,"mm of water"]
[{"$f":"IF(Facility_Information!B30=\"\",\"\",Facility_Information!B30)","v":""},{"$f":"IF(Table5[[#This Row],[Company]]=\"\",\"\",MAX(B$1:B7)+1)","v":""},"",null,"CO",null,"gallons"]
[{"$f":"IF(Facility_Information!B31=\"\",\"\",Facility_Information!B31)","v":""},{"$f":"IF(Table5[[#This Row],[Company]]=\"\",\"\",MAX(B$1:B8)+1)","v":""},"",null,"CT"]
[{"$f":"IF(Facility_Information!B32=\"\",\"\",Facility_Information!B32)","v":""},{"$f":"IF(Table5[[#This Row],[Company]]=\"\",\"\",MAX(B$1:B9)+1)","v":""},"",null,"DC",null,"CMS"]
{"$rows_left_out":191}